program: Gaussian 09
title: 000235256
version: EM64L-G09RevD.01
frameworkgroup: C1[X(C6H7N3O4)]
method: RPBEPBE
basis: SDD
operation: Freq
keyword: #pfreq=noraman
keyword: PBEPBE/SDD
title: #p freq=noraman PBEPBE/SDD
converged: NO NO NO NO
title: Mulliken charges:
elementType: O O O O N N N C C C C C C H H H H H H H
charge: -0.292624 -0.264383 -0.245328 -0.288597 -0.380078 -0.354135 -0.423832 0.289135 0.116874 -0.223192 0.152972 0.265326 -0.493010 0.324351 0.368411 0.354238 0.369742 0.242906 0.242919 0.238306
chargesum: 0.00000
title: Mulliken charges with hydrogens summed into heavy atoms:
elementType: O O O O N N N C C C C C C
charge: -0.292624 -0.264383 -0.245328 -0.288597 -0.011667 0.000102 -0.054090 0.289135 0.116874 0.101159 0.152972 0.265326 0.231122
polarizability: 1.63699671e+02 1.08529504e+01 1.05698924e+02 -8.19595064e-03 -9.29945232e-03 4.55914137e+01
1716.lowfreq: -0.0009 -0.0006 0.0001 5.8667 8.7044 16.3182 55.5010 80.9034 94.9564
frequency: 55.4861 80.8043 94.9395 106.5462 125.1374 178.3678 181.8117 243.0074 263.7540 340.8087 371.1152 375.1416 410.9910 516.4612 542.1654 574.2748 637.2363 677.8469 691.5050 698.0657 734.6095 745.5493 750.3349 781.4575 821.6058 900.0319 902.3489 948.8886 1023.5742 1121.6579 1138.7762 1152.2211 1184.8892 1203.8181 1261.5706 1342.5177 1362.7333 1386.6838 1424.2731 1438.7039 1453.4902 1468.1326 1527.9307 1611.8102 1644.1783 1660.9106 1686.7192 3001.4671 3102.1270 3148.2924 3202.4772 3479.7079 3526.1028 3566.0256
redmass: 5.2260 1.5894 2.8161 5.3396 3.7639 7.5239 5.5481 5.5833 8.5341 6.5702 5.9336 11.3294 3.9492 7.7433 7.3161 6.7472 1.3050 5.9705 5.3689 2.1406 3.1001 8.3999 1.3639 2.2324 5.9460 1.3120 7.3097 3.2105 7.5322 1.2529 2.0980 1.4879 4.0254 2.4412 3.3464 2.2084 1.7506 2.8828 1.3266 1.7717 1.0493 1.0632 2.4906 7.6229 7.9914 5.9338 6.0709 1.0301 1.1049 1.1042 1.0959 1.0765 1.0771 1.0785
irintensity: 0.0079 0.6834 7.1868 2.7547 7.0249 0.9963 4.7126 15.9162 3.3794 21.8950 0.0492 18.5505 12.4549 14.9262 20.1549 4.8712 81.0570 11.2774 0.3838 0.9473 6.9352 9.0186 134.2588 170.4089 7.1844 38.0494 7.5900 13.4091 131.7776 0.2429 36.6389 101.1133 173.5891 102.6856 23.7007 10.0636 98.4815 255.7456 23.5454 169.6727 14.4223 23.5996 489.3400 399.2074 83.7520 327.1525 520.1451 43.1427 28.1484 15.7751 5.4455 90.7003 68.0960 95.0305
temp: 298.150 k
press: 1.00000 atm
elementType: 8 8 8 8 7 7 7 6 6 6 6 6 6 1 1 1 1 1 1 1
symmnumber: 1
zpe: 376052.6 jmol-1
zpe.correction: 0.143231 hartree
zpe.thermalcorrener: 0.155188 hartree
zpe.thermalcorrenthalpy: 0.156132 hartree
zpe.thermalcorrgfe: 0.104400 hartree
zpe.sumelectzpe: -697.079724 hartree
zpe.sumelectthermal: -697.067767 hartree
zpe.sumelectthermalent: -697.066822 hartree
zpe.sumelectthermalfe: -697.118554 hartree
dipole: 2.9197 -1.7115 0.0001
dipole: 3.3844
quadrupole: -75.7669 -77.8269 -74.8541
quadrupole: 0.2954 0.0033 0.0012
quadrupole: 0.3825 -1.6776 1.2952 0.2954 0.0033 0.0012
hfenergy: -697.2229545 hartree
pointgroup: C01 [X(C6H7N3O4)]
dipole: 1.1518067 0.6680476 -0.0000317 debye
dipolederiv: -1.882181 0.1243033 0.0001082 0.5008285 -0.5184263 0.0000538 0.0005892 -0.0000098 -0.3228203 -0.5858555 0.1267656 -0.0000349 0.1731579 -1.2166832 0.000122 -0.0000535 0.0001423 -0.3700808 -1.6320483 0.2413941 -0.0001741 0.2066286 -0.5178071 0.0000406 -0.0001856 0.000044 -0.3890771 -0.7396258 -0.0131546 0.0000029 -0.2901127 -0.8896939 -0.0001483 0.0002607 0.0002788 -0.3540703 -0.8666945 0.4120583 -0.0001191 0.4409211 -0.692846 0.0001028 -0.0001191 0.0000923 -0.3362234 -1.3879661 0.4594895 -0.0001574 -0.5374253 -0.4196265 -0.0000507 -0.000083 0.0000753 -0.3042631 -1.9325886 0.0211289 0.0000181 -0.6162706 -0.4514789 0.0000475 -0.0000142 0.0000428 -0.3092939 0.9625822 -0.4498763 0.0001369 -0.3622484 -0.6112178 0.000038 0.0001695 -0.0000169 0.0122307 0.9775616 -0.0534079 0.0001104 -0.2450635 1.557547 -0.0001929 0.0000775 -0.0001608 0.2597544 0.6121426 -0.6305937 0.0001534 0.0583967 0.3526061 -0.0000332 0.0000898 -0.000134 -0.0668122 2.2276342 -0.3223815 0.0002648 0.1319422 1.0069603 -0.0000715 0.0002497 -0.0001181 0.322004 2.6636089 -0.0095305 -0.0001017 0.3736535 1.2510641 0.0001024 -0.0006487 -0.0002225 0.3291067 0.8573498 0.0433092 -0.0000834 0.2363068 0.2375538 -0.0000352 -0.0001893 0.0000211 0.2853183 0.1539935 -0.0136277 -0.0000152 -0.0439611 0.097606 0.0000076 -0.0000298 0.0000109 0.2027023 0.1974902 0.045581 -0.0000252 0.0589069 0.1974088 0.0000228 -0.0000198 0.000022 0.3452198 0.15515 -0.008869 -0.0000252 -0.0627423 0.2793777 0.0000028 -0.0000208 0.0000084 0.3521704 0.2812765 -0.0480935 -0.0000158 0.082538 0.2734985 0.000006 -0.0000537 -0.0000083 0.3361258 -0.0026633 0.0005206 0.0197759 -0.1175757 0.0342661 -0.0996649 -0.0356631 -0.0915004 -0.0592364 -0.002622 0.0006192 -0.0198841 -0.1174612 0.0342528 0.0997196 0.0355537 0.0914871 -0.0591853 -0.0565444 0.074365 0.0000654 0.1295806 -0.0043615 -0.0000692 0.0000906 -0.000054 0.1264303 unknown
polarizability: 163.5979966|-11.1208549|105.8005992|0.0081528|-0.0093373|45.5914137 unknown
InChI: InChI=1S/C6H7N3O4/c1-13-6(12)8-3-2-7-5(11)9-4(3)10/h2,7-9H,1H3
charge 0 multiplicity 1
20 atoms
O  3.471813 -0.549104 0.00023
O  -0.779912 -2.452217 0.000403
O  -4.17702 0.794284 -0.000447
O  2.330257 1.516049 -0.000047
N  -2.45387 -0.809235 -0.00004
N  -1.927959 1.474337 -0.000219
N  1.209027 -0.558132 0.000469
C  -0.127019 -0.121779 0.000212
C  -1.104762 -1.226016 0.000182
C  -0.562063 1.187839 0.000005
C  -2.949542 0.511074 -0.000258
C  2.324968 0.255274 0.000524
C  4.748694 0.195073 -0.000335
H  0.136989 2.024838 0.000026
H  -3.162999 -1.549753 -0.000042
H  -2.247019 2.444736 -0.000364
H  1.335171 -1.577764 0.000602
H  4.825224 0.828898 0.89961
H  4.824367 0.82905 -0.900243
H  5.524056 -0.583553 -0.000766
