program: Gaussian 09
title: 000235240
version: EM64L-G09RevD.01
frameworkgroup: C1[X(C15H12O7)]
method: RPBEPBE
basis: SDD
operation: Freq
keyword: #pfreq=noraman
keyword: PBEPBE/SDD
title: #p freq=noraman PBEPBE/SDD
converged: YES YES NO NO
title: Mulliken charges:
elementType: O O O O O O O C C C C C C C C C C C C C C C H H H H H H H H H H H H
charge: -0.289623 -0.405903 -0.213329 -0.488448 -0.411247 -0.435976 -0.484275 -0.288983 -0.252953 0.558640 0.115207 0.260769 0.249791 -0.540635 -0.384710 -0.513360 -0.509189 0.154111 0.193462 0.183355 -0.335974 0.132284 0.245637 0.283409 0.256320 0.245204 0.277810 0.285230 0.352569 0.222307 0.383960 0.393517 0.385920 0.375104
chargesum: 0.00000
title: Mulliken charges with hydrogens summed into heavy atoms:
elementType: O O O O O O O C C C C C C C C C C C C C C C
charge: -0.289623 -0.053335 -0.213329 -0.104489 -0.017730 -0.050056 -0.109171 -0.043346 0.030456 0.558640 0.115207 0.260769 0.249791 -0.284315 -0.139506 -0.235550 -0.223959 0.154111 0.193462 0.183355 -0.113667 0.132284
polarizability: 2.98937062e+02 -8.92960139e+00 1.83029900e+02 -5.14120824e+00 -1.68646125e+01 1.13514159e+02
1716.lowfreq: -7.3493 -2.3591 -0.4813 -0.0010 -0.0006 -0.0003 18.9911 41.7863 48.7561
frequency: 18.7158 41.7313 48.7460 72.5184 93.3598 135.1619 161.4119 184.9864 192.5717 211.8364 222.6564 230.0242 252.6612 273.3043 280.2068 284.6931 289.5487 295.9488 319.3433 353.0564 380.3338 395.9804 431.5118 433.7580 438.6503 457.4604 486.6771 487.6785 534.8465 539.7164 563.3324 571.0477 602.0436 633.2325 643.6601 672.5309 706.7808 715.6873 722.9021 749.0999 758.6504 762.9112 788.7108 800.6652 821.9879 860.1882 866.4271 881.1675 888.4358 923.1284 931.3589 961.2415 1017.1447 1026.7800 1072.7861 1089.5860 1124.7720 1144.7029 1158.5906 1169.0830 1182.9376 1190.5261 1200.6462 1210.7607 1242.1345 1246.9549 1270.3189 1272.6636 1298.0681 1315.4880 1328.0423 1341.2119 1363.5999 1411.2865 1418.2047 1454.9999 1470.0075 1507.6683 1511.7107 1588.1412 1589.7802 1613.2916 1635.2280 1639.7310 2979.0443 3093.6158 3125.1171 3133.8943 3148.2506 3177.4922 3190.2393 3503.5739 3527.3744 3528.3973 3623.4538 3628.0760
redmass: 6.2286 6.5112 6.9234 7.0377 8.6846 6.8125 7.2576 8.2681 5.8577 6.8183 4.1535 6.1603 4.3709 1.3006 3.3775 4.8646 4.0164 1.1691 1.5784 7.1724 6.4147 10.4121 3.7366 4.9083 3.1734 4.8762 1.7515 2.2125 6.4151 1.0997 5.2450 5.9993 5.5034 6.4992 6.7601 6.1598 4.7205 3.9060 6.8946 3.6084 6.0830 4.7441 2.9651 1.9444 4.5177 3.6135 1.6669 1.5653 1.4477 1.6271 2.7039 3.4983 4.4752 3.9542 2.2097 1.9633 2.0318 1.2153 1.5886 1.7477 1.3764 1.7620 1.6073 1.7090 1.7834 1.6083 2.2123 2.5317 1.3332 2.0163 1.7362 2.1439 1.3215 4.7755 4.8487 6.0022 3.3205 3.4562 4.1894 8.1470 9.1136 7.1360 6.7125 7.8634 1.0842 1.0874 1.0902 1.0920 1.0922 1.0942 1.0930 1.0647 1.0657 1.0649 1.0666 1.0667
irintensity: 0.8749 4.0538 1.3074 0.5036 1.9044 0.3008 0.5282 2.0002 11.6981 0.9926 8.2957 17.3644 16.6546 123.7781 35.7867 26.1619 24.8365 166.4340 150.1273 0.5630 6.7399 1.2496 0.9287 5.0001 22.2248 6.6623 70.9316 66.8979 13.8979 142.1532 21.3318 23.8618 2.7837 0.4151 1.1475 32.6172 4.4773 1.1216 4.9594 19.3992 21.7998 58.5521 42.8326 7.5928 30.9246 52.8374 26.1195 15.7883 29.9392 11.8033 28.5079 50.8915 26.6016 50.4543 302.6264 178.7458 374.1325 21.3718 76.4415 32.8596 48.9364 28.2849 113.0721 21.0525 93.5896 27.8784 189.0321 88.1210 30.5311 24.3905 30.3966 120.3626 94.4980 71.7224 48.2729 223.3242 10.2707 177.3706 55.4852 281.0273 106.9097 36.7035 5.5759 80.3063 17.0582 8.8247 18.2941 9.1330 2.4756 3.7907 0.2431 152.9095 7.5757 95.3725 72.3760 76.5326
temp: 298.150 k
press: 1.00000 atm
elementType: 8 8 8 8 8 8 8 6 6 6 6 6 6 6 6 6 6 6 6 6 6 6 1 1 1 1 1 1 1 1 1 1 1 1
symmnumber: 1
zpe: 640837.5 jmol-1
zpe.correction: 0.244082 hartree
zpe.thermalcorrener: 0.263659 hartree
zpe.thermalcorrenthalpy: 0.264604 hartree
zpe.thermalcorrgfe: 0.196004 hartree
zpe.sumelectzpe: -1103.763156 hartree
zpe.sumelectthermal: -1103.743579 hartree
zpe.sumelectthermalent: -1103.742634 hartree
zpe.sumelectthermalfe: -1103.811234 hartree
dipole: 0.8993 -3.3301 0.6499
dipole: 3.5101
quadrupole: -83.5665 -138.8199 -128.2890
quadrupole: 17.0006 -11.2707 -10.1389
quadrupole: 33.3253 -21.9281 -11.3972 17.0006 -11.2707 -10.1389
hfenergy: -1104.0072381 hartree
pointgroup: C01 [X(C15H12O7)]
dipole: -0.3494303 1.2777065 0.3904619 debye
polarizability: 298.8851728|-9.7670548|178.8659562|4.0826253|23.6652822|117.7299918 unknown
InChI: InChI=1S/C15H12O7/c16-8-2-1-6(3-9(8)17)15-14(21)13(20)7-4-10(18)11(19)5-12(7)22-15/h1-5,14-19,21H
charge 0 multiplicity 1
34 atoms
O  -0.324719 0.786422 0.130752
O  0.272304 -1.533124 1.785004
O  -1.710804 -3.155839 -0.221417
O  -5.886979 0.119833 -0.307248
O  -4.800366 2.547543 -0.058557
O  5.322518 -0.56002 -1.680839
O  6.09802 0.970719 0.401535
C  0.560619 -0.311613 -0.378278
C  0.14027 -1.629557 0.324046
C  1.996901 0.099953 -0.144413
C  -1.324624 -1.964328 -0.03876
C  -2.225109 -0.793094 -0.093117
C  -1.704255 0.531735 0.018192
C  2.990776 -0.385641 -1.029936
C  2.367224 0.909265 0.954194
C  -3.633641 -0.970762 -0.216404
C  -2.556025 1.655589 0.03343
C  -4.478126 0.135977 -0.203449
C  -3.942059 1.457852 -0.070532
C  4.343869 -0.079022 -0.807776
C  3.726307 1.23086 1.174747
C  4.707902 0.731412 0.301154
H  0.363603 -0.424168 -1.465095
H  0.796587 -2.461853 0.025598
H  2.734776 -1.003777 -1.897303
H  1.597846 1.310462 1.618085
H  -4.00767 -1.998348 -0.302827
H  -2.148552 2.665925 0.108657
H  -0.108372 -0.663131 2.077741
H  4.01171 1.863368 2.024516
H  -6.246658 -0.794863 -0.391663
H  -5.736278 2.22258 -0.153251
H  6.211715 -0.240715 -1.373477
H  6.32369 1.522365 1.187797
