program: Gaussian 09
title: 000235238
version: EM64L-G09RevD.01
frameworkgroup: C1[X(C8H4N2O6S)]
method: RPBEPBE
basis: SDD
operation: Freq
keyword: #p
keyword: freq=noraman
keyword: PBEPBE/SDD
title: #p freq=noraman PBEPBE/SDD
converged: YES YES NO NO
title: Mulliken charges:
elementType: S O O O O O O N N C C C C C C C C H H H H
charge: 0.396323 -0.152635 -0.151922 -0.200711 -0.200412 -0.181601 -0.181087 0.051583 0.051588 -0.108003 -0.110072 -0.192893 -0.191163 0.295243 0.295330 -0.297516 -0.297556 0.288068 0.288234 0.299610 0.299595
chargesum: 0.00000
title: Mulliken charges with hydrogens summed into heavy atoms:
elementType: S O O O O O O N N C C C C C C C C
charge: 0.396323 -0.152635 -0.151922 -0.200711 -0.200412 -0.181601 -0.181087 0.051583 0.051588 -0.108003 -0.110072 0.095174 0.097072 0.295243 0.295330 0.002094 0.002039
polarizability: 1.95945669e+02 -2.68711366e-01 1.24867695e+02 -1.14732065e+01 1.38054617e+00 1.43928295e+02
1716.lowfreq: -6.1478 -3.3639 0.0011 0.0011 0.0015 1.8257 11.6579 15.8407 34.1978
frequency: 11.5167 15.5230 34.1938 66.2333 74.5219 128.1414 128.4696 160.2185 166.5405 248.3667 268.0262 305.1549 311.8450 378.3117 381.5581 471.8243 480.5609 529.7715 533.1759 569.3697 569.8262 605.3470 639.8484 689.0508 690.1645 736.5453 736.8304 826.0272 827.0888 887.2215 890.0602 904.5766 905.1019 913.1790 913.5870 1002.8903 1012.1542 1038.6212 1060.9987 1137.5972 1139.9953 1191.2978 1195.1658 1249.7649 1252.7266 1335.1541 1337.7516 1365.1409 1365.5395 1435.0321 1457.0639 1541.2960 1545.3385 3242.0757 3242.0873 3260.0592 3260.1067
redmass: 10.7418 7.4441 8.7801 11.3567 8.4480 10.9085 9.9762 14.2989 11.5537 7.0073 7.9189 9.6630 6.4222 14.7130 12.0963 8.4262 7.9592 11.9727 10.6556 5.5574 5.2580 5.2344 5.9880 8.4144 8.2585 12.8851 12.8700 1.2621 1.2710 8.3869 8.4176 1.4119 1.4095 7.2172 7.1449 1.9510 1.3737 2.6638 5.7433 4.8915 5.3370 1.6852 1.6564 11.2475 11.5411 3.8910 3.9666 11.2488 11.2543 8.8140 9.3788 6.4930 6.4904 1.0959 1.0959 1.1045 1.1046
irintensity: 4.2177 2.7332 1.2567 0.7987 2.5533 0.1708 0.3731 4.5663 0.4914 3.4297 1.6467 11.4524 3.3847 0.1679 7.2002 0.0070 0.8391 2.6597 0.3321 0.2019 1.1242 0.6310 7.5103 14.1545 12.7202 32.0678 21.4074 62.0327 55.4827 28.0356 2.7699 1.8840 2.3293 9.0243 8.0315 36.6209 3.8575 28.7347 0.5090 89.4089 52.1269 60.3809 40.4620 324.9524 134.7564 8.7936 2.1826 153.3635 123.5078 209.6050 76.1449 26.6050 7.9734 0.2483 0.6182 14.9158 0.6219
temp: 298.150 k
press: 1.00000 atm
elementType: 16 8 8 8 8 8 8 7 7 6 6 6 6 6 6 6 6 1 1 1 1
symmnumber: 1
zpe: 315010.5 jmol-1
zpe.correction: 0.119981 hartree
zpe.thermalcorrener: 0.134857 hartree
zpe.thermalcorrenthalpy: 0.135801 hartree
zpe.thermalcorrgfe: 0.073250 hartree
zpe.sumelectzpe: -1264.682893 hartree
zpe.sumelectthermal: -1264.668017 hartree
zpe.sumelectthermalent: -1264.667073 hartree
zpe.sumelectthermalfe: -1264.729624 hartree
dipole: -0.0623 5.0756 -0.1271
dipole: 5.0776
quadrupole: -127.6379 -108.9468 -97.9788
quadrupole: -0.7408 -22.7874 0.2420
quadrupole: -16.1167 2.5744 13.5424 -0.7408 -22.7874 0.2420
hfenergy: -1264.802874 hartree
pointgroup: C01 [X(C8H4N2O6S1)]
dipole: -0.0707068 -1.9831596 0.2297048 debye
dipolederiv: 0.1758573 0.0112423 0.0320869 -0.0251465 0.3243243 -0.0392035 -0.345687 -0.0225442 -0.0090223 -0.3057817 0.0838372 -0.1598602 0.2398724 -0.2527604 -0.0574294 -0.1927279 -0.1058947 -0.4884778 -0.322249 -0.1151139 -0.1288536 -0.2734413 -0.2071953 -0.0068661 -0.1215034 0.0446326 -0.5185466 -0.7554011 0.3186313 -0.096424 0.3969935 -0.5055987 -0.0254098 -0.151882 0.0247507 -0.4360435 -0.7819461 -0.3174367 -0.0230103 -0.4094954 -0.4681981 0.0326167 -0.0597511 -0.0140809 -0.4439054 -0.3457877 0.0614306 -0.0970354 0.1556379 -0.3804716 -0.1790317 0.0603635 -0.2301491 -0.7175274 -0.3563942 -0.084802 -0.0635337 -0.1369629 -0.2950857 0.077297 0.1107506 0.1184075 -0.7941608 1.1001189 -0.6227844 0.0495536 -0.8979698 1.0510605 0.4590653 -0.2099406 0.5049632 1.1464865 1.1719539 0.609921 -0.1258102 0.814637 0.7687719 -0.3574125 -0.4403897 -0.3876304 1.3570682 0.4672238 -0.3504147 0.139896 -0.3924319 -0.0053038 0.0601489 0.4035065 -0.0319142 0.2327033 0.4933175 0.3425251 0.0572205 0.4428946 -0.0443576 -0.0023654 0.3053143 0.0664288 0.2333731 -0.4712869 0.1752827 -0.0248052 0.1600326 -0.16469 0.0596424 -0.1039747 0.1679635 0.0360403 -0.4733781 -0.1557341 0.0040116 -0.1666781 -0.188352 -0.0040373 -0.0772096 -0.1057068 0.0758249 -0.1006284 0.1499475 0.1894996 0.4799824 -0.2927761 -0.2563589 0.588633 -0.4979054 -0.058576 -0.1417196 -0.1104631 0.2372625 -0.3308022 -0.0828385 0.2524161 0.7062755 0.4703559 -0.2236685 0.0310113 -0.1337944 0.0180332 -0.2466042 0.1392303 0.0461534 -0.2327554 0.2189463 0.0492204 0.0482857 0.1378091 -0.0166081 0.1839146 0.0558665 -0.0439593 -0.290478 -0.2054876 0.1069443 0.1615622 0.0523192 0.027615 0.0462957 0.1171058 -0.0449788 0.0287309 -0.0429643 0.0893343 0.1565787 -0.0456642 0.0428765 -0.0397062 0.139203 0.0301464 0.0427968 0.0285612 0.0724681 0.1271478 0.0499253 -0.0373868 0.0787251 0.1437505 0.0061544 -0.0194858 0.0003017 0.1449368 0.1215155 -0.0566639 -0.0247278 -0.0797474 0.1483151 -0.006588 -0.0005859 -0.0010338 0.1455281 unknown
polarizability: 197.9578265|-1.0700173|125.2440149|4.7697885|2.6971962|141.5398181 unknown
InChI: InChI=1S/C8H4N2O6S/c11-9(12)5-1-3-7(15-5)17-8-4-2-6(16-8)10(13)14/h1-4H
charge 0 multiplicity 1
21 atoms
S  -0.124337 -2.574957 0.311904
O  -1.914773 -0.52693 0.797526
O  1.770557 -0.7826 -0.600001
O  -4.612528 1.780879 0.297292
O  4.567512 1.459929 -0.594286
O  -3.226325 1.464898 2.106004
O  3.197817 0.776747 -2.311776
N  -3.630797 1.196529 0.911052
N  3.569528 0.786999 -1.076888
C  -1.438869 -1.437543 -0.170223
C  1.23774 -1.41518 0.544237
C  -2.172999 -1.32105 -1.346762
C  1.959209 -1.052328 1.677504
C  -2.957539 0.161531 0.167539
C  2.835326 -0.009203 -0.125437
C  -3.15634 -0.29418 -1.129545
C  2.993166 -0.149634 1.247576
H  -2.004741 -1.890877 -2.257193
H  1.751025 -1.380991 2.692664
H  -3.901575 0.078235 -1.827425
H  3.744944 0.346926 1.855338
