program: Gaussian 09
title: 000235217
version: EM64L-G09RevD.01
frameworkgroup: C1[X(C21H20N8O4)]
method: RPBEPBE
basis: SDD
operation: Freq
keyword: #p
keyword: freq=noraman
keyword: PBEPBE/SDD
title: #p freq=noraman PBEPBE/SDD
converged: YES YES NO NO
title: Mulliken charges:
elementType: O O O O N N N N N N N N C C C C C C C C C C C C C C C C C C C C C H H H H H H H H H H H H H H H H H H H H
charge: -0.210366 -0.337278 -0.325944 -0.339335 -0.525723 -0.481139 -0.337087 -0.410682 -0.375065 -0.311363 0.003980 -0.003296 0.070465 0.406158 0.370167 -0.446326 -0.362959 -0.217798 -0.818748 0.204896 0.282552 0.315194 0.253220 0.281999 0.218095 -0.292536 -0.298146 -0.281013 -0.283955 -0.334599 -0.339364 -0.324363 -0.338559 0.234562 0.307241 0.227121 0.302104 0.222865 0.234611 0.250077 0.368820 0.308361 0.416499 0.339319 0.352880 0.214160 0.331700 0.268856 0.215530 0.246979 0.257496 0.245071 0.244662
chargesum: 0.00000
title: Mulliken charges with hydrogens summed into heavy atoms:
elementType: O O O O N N N N N N N N C C C C C C C C C C C C C C C C C C C C C
charge: -0.210366 -0.337278 -0.325944 -0.339335 -0.223619 -0.112318 -0.028726 0.005817 -0.035747 0.041517 0.003980 -0.003296 0.070465 0.406158 0.370167 -0.211763 -0.055718 0.009323 -0.111194 0.204896 0.282552 0.315194 0.253220 0.281999 0.218095 -0.078376 0.033555 -0.012157 -0.068426 -0.087620 -0.081868 -0.079292 -0.093897
polarizability: 4.89791422e+02 2.59630690e+01 3.44422963e+02 3.15435315e+00 -1.17351198e+01 1.56877000e+02
1716.lowfreq: -9.6032 -5.3872 -1.7278 -0.0008 0.0006 0.0008 3.4871 19.2398 23.6336
frequency: -9.3833 19.0856 23.6177 32.5401 42.1614 54.5683 57.7303 62.6721 74.3970 83.2547 89.4282 108.9346 112.6659 119.8153 123.4354 143.9122 151.6758 168.4977 172.5218 185.8106 225.2616 230.4513 243.0819 270.5195 283.4925 299.6461 304.2564 313.7496 318.9951 336.5053 363.7441 363.9404 384.2910 403.5276 414.2371 443.0805 467.4517 476.9204 496.8921 501.2664 504.1815 515.5027 549.0738 564.6724 580.6808 618.6773 639.6585 657.6676 658.9443 660.8719 668.5565 670.0542 677.4863 694.3171 703.2814 709.7726 717.5477 725.5155 746.6181 753.4769 771.3949 787.1564 797.3851 805.0309 830.7156 833.8115 843.5329 873.0103 886.7640 888.2037 903.2207 911.5422 938.8399 958.1161 960.3251 961.7218 965.0289 967.3060 989.6900 991.9654 999.4524 1022.4294 1044.6147 1048.8891 1058.0909 1059.5690 1069.3356 1083.7108 1090.4837 1098.5111 1108.5795 1144.1153 1184.7749 1204.3929 1216.4000 1223.6930 1227.7036 1232.0104 1243.4088 1266.2793 1284.6107 1298.7322 1303.5572 1305.2253 1323.6218 1332.0705 1335.4342 1365.7825 1398.1873 1399.5656 1400.7510 1421.6595 1439.0616 1443.4229 1450.2044 1455.8612 1467.9933 1469.0996 1471.0152 1476.0794 1483.5427 1515.4023 1538.1849 1545.3361 1559.2930 1577.6148 1578.5224 1587.2462 1590.3690 1603.6390 1605.9600 1645.4393 1679.0807 2971.8677 3051.9546 3093.4589 3128.6214 3128.8503 3131.5591 3138.6735 3139.0163 3151.5151 3152.0248 3154.2330 3160.2340 3174.6387 3192.5317 3313.7424 3436.1116 3455.3493 3463.6906 3504.7066 3567.2726
redmass: 3.6109 6.7265 6.4701 6.0566 6.6098 4.4676 7.5371 6.7564 5.4606 5.8819 6.4658 4.1995 1.6012 3.0535 6.7977 6.6463 6.9368 6.0494 6.8987 5.6087 4.4913 3.4684 3.3565 6.0522 4.0517 6.6027 3.9493 4.4693 8.0007 4.7881 2.4933 2.4805 4.9547 4.7130 2.4812 6.5642 5.0901 5.2929 3.6730 4.0061 2.6807 2.0040 5.1683 3.3365 1.7853 5.3900 1.6959 6.5012 6.6030 6.9472 6.3779 4.5584 1.4005 5.6808 4.1935 4.8711 2.9329 2.9927 2.9589 2.8226 5.5562 2.5083 1.3804 1.3730 1.6183 1.7178 5.2212 6.1401 1.2683 6.2860 1.2744 1.3599 3.3078 2.8939 5.1032 1.5539 2.4139 3.5886 1.4226 1.3237 2.2300 1.3643 1.6820 3.1050 3.7566 2.2499 2.2737 2.2635 1.7464 2.4587 1.8192 2.9180 1.2454 2.9992 2.3088 1.4797 1.8583 1.6424 2.6437 1.7703 2.1102 6.0525 7.0408 3.1496 2.5858 1.4792 1.3738 6.6867 1.8382 1.2541 1.9033 2.0783 1.6221 1.7292 1.8073 1.5583 1.7703 1.5539 1.4617 2.1451 1.4700 3.6146 6.3289 3.9452 2.9246 5.9823 5.9444 5.8949 6.3295 6.2887 6.2203 2.6885 6.4415 1.0407 1.0932 1.0990 1.0878 1.0876 1.0872 1.0914 1.0906 1.0963 1.0976 1.0959 1.0980 1.0960 1.0952 1.0868 1.0777 1.0765 1.0785 1.0760 1.0796
irintensity: 0.0352 1.5572 0.1345 0.0771 3.0651 0.4605 5.9004 0.1593 0.8214 1.6321 0.3307 6.5941 2.1212 2.5180 4.5265 3.2751 0.3783 11.5360 10.2687 15.2438 12.5040 7.0166 10.0454 1.1339 6.7272 20.0300 0.3591 8.3805 3.2179 8.5506 0.8738 0.6388 11.3774 0.5866 37.7168 27.6866 8.9133 21.1038 7.8659 0.9009 19.3692 44.8976 1.2328 13.7295 183.5259 30.4754 30.7885 12.7660 20.0297 2.2110 9.2600 27.1557 27.9091 22.4026 6.3774 7.0610 14.1977 16.4990 7.5688 11.4425 15.1459 120.2884 6.2175 219.3437 28.1689 33.8259 7.7337 4.7536 1.7800 10.0942 12.7626 4.5099 43.3087 3.7508 4.8768 0.9774 1.0624 12.7949 0.7142 3.4389 4.5292 9.5804 7.7515 6.0278 22.6293 11.2035 4.0620 2.0057 0.5479 12.6693 2.7564 107.2477 3.4060 20.9722 18.9986 90.7700 78.7710 110.5655 103.2939 10.4048 122.4700 13.9524 16.5885 40.4963 73.1477 3.5908 1.5531 32.8168 8.5912 11.7798 18.9315 590.0445 331.2414 30.3032 127.5637 131.2708 22.1447 40.4146 36.7855 206.0163 27.1120 92.3308 249.5928 342.2145 399.1123 183.6478 17.0107 166.9459 47.6547 158.3001 47.6061 117.7304 145.6967 38.1676 18.4465 21.7719 5.9500 8.8683 7.0727 64.8000 67.7016 18.9450 16.5429 29.7386 16.6408 6.1610 8.7960 500.7197 280.1340 5.8280 156.2317 25.2805 32.4359
temp: 298.150 k
press: 1.00000 atm
elementType: 8 8 8 8 7 7 7 7 7 7 7 7 6 6 6 6 6 6 6 6 6 6 6 6 6 6 6 6 6 6 6 6 6 1 1 1 1 1 1 1 1 1 1 1 1 1 1 1 1 1 1 1 1
symmnumber: 1
zpe: 1048750.6 jmol-1
zpe.correction: 0.399448 hartree
zpe.thermalcorrener: 0.428317 hartree
zpe.thermalcorrenthalpy: 0.429261 hartree
zpe.thermalcorrgfe: 0.337961 hartree
zpe.sumelectzpe: -1548.817421 hartree
zpe.sumelectthermal: -1548.788552 hartree
zpe.sumelectthermalent: -1548.787608 hartree
zpe.sumelectthermalfe: -1548.878908 hartree
dipole: -6.5933 2.9459 -4.2162
dipole: 8.3622
quadrupole: -194.5516 -183.6239 -192.3922
quadrupole: -5.8266 12.1745 -8.4363
quadrupole: -4.3624 6.5653 -2.2029 -5.8266 12.1745 -8.4363
hfenergy: -1549.2168689 hartree
pointgroup: C01 [X(C21H20N8O4)]
dipole: -2.3420698 -1.7495538 1.5091266 debye
polarizability: 493.7889112|5.9883934|340.8833942|9.6829786|-3.2823809|156.4190801 unknown
InChI: InChI=1S/C21H20N8O4/c1-13-3-2-4-16(24-20(32)28-26-18(30)14-5-9-22-10-6-14)17(13)25-21(33)29-27-19(31)15-7-11-23-12-8-15/h2-12,24-29H,1H3
charge 0 multiplicity 1
53 atoms
O  -2.776609 -1.87124 -1.173158
O  -0.792378 3.127202 -0.282907
O  -0.249708 -1.452871 0.666912
O  2.942538 0.256095 0.729015
N  -3.820998 -0.895215 0.699211
N  -1.890098 1.041721 0.122675
N  -2.559936 -2.870763 0.958371
N  0.418234 1.23853 0.293007
N  -1.353708 -3.475744 0.575506
N  1.558205 2.037977 0.244163
N  3.367884 -4.59203 -1.177855
N  6.290138 4.111373 0.299846
C  -4.229263 0.340711 0.071323
C  -5.598494 0.565094 -0.221603
C  -3.236577 1.341355 -0.186164
C  -5.977308 1.81528 -0.766481
C  -3.64263 2.586404 -0.7354
C  -5.00454 2.808546 -1.015821
C  -6.629251 -0.516634 0.045755
C  -3.055433 -1.862951 0.050352
C  -0.7869 1.885345 0.014892
C  0.990094 -3.374918 -0.180151
C  -0.224676 -2.691009 0.365622
C  3.961007 2.452655 0.401581
C  2.799238 1.503362 0.473109
C  0.938101 -4.609796 -0.879944
C  2.249411 -2.747035 -0.009249
C  5.257315 1.908763 0.579386
C  3.855792 3.850194 0.17429
C  2.143124 -5.172667 -1.353668
C  3.397625 -3.393945 -0.519151
C  6.377714 2.764296 0.520626
C  5.034873 4.626369 0.132289
H  -7.03098 2.002515 -1.000286
H  -2.889933 3.355202 -0.918544
H  -5.308528 3.772066 -1.439559
H  -4.11891 -1.056336 1.664956
H  -6.800094 -0.669436 1.129878
H  -7.599656 -0.24859 -0.404211
H  -6.309836 -1.487218 -0.374502
H  -1.67507 0.078669 0.409866
H  -2.587852 -2.645137 1.960479
H  0.541844 0.225973 0.47065
H  -1.398703 -4.45238 0.285653
H  1.330809 3.009975 -0.000064
H  -0.005205 -5.119105 -1.106827
H  2.339046 -1.773349 0.484831
H  5.36251 0.835366 0.760761
H  2.894399 4.356653 0.034464
H  2.138323 -6.12002 -1.903777
H  4.385519 -2.936799 -0.403474
H  7.390919 2.369487 0.653842
H  4.982911 5.706911 -0.041415
