program: Gaussian 09
title: 000235214
version: EM64L-G09RevD.01
frameworkgroup: C1[X(C13H11ClN4O2)]
method: RPBEPBE
basis: SDD
operation: Freq
keyword: #p
keyword: freq=noraman
keyword: PBEPBE/SDD
title: #p freq=noraman PBEPBE/SDD
converged: YES YES NO NO
title: Mulliken charges:
elementType: Cl O O N N N N C C C C C C C C C C C C C H H H H H H H H H H H
charge: -0.057930 -0.322162 -0.324558 -0.476210 -0.333313 -0.371062 -0.000321 0.493505 -0.434488 -0.322534 0.292888 0.218883 -0.183160 -0.194801 0.316952 -0.122260 -0.277813 -0.287769 -0.322606 -0.333320 0.304465 0.225549 0.310917 0.256648 0.255780 0.359274 0.344729 0.275366 0.214055 0.248322 0.246975
chargesum: 0.00000
title: Mulliken charges with hydrogens summed into heavy atoms:
elementType: Cl O O N N N N C C C C C C C C C C C C C
charge: -0.057930 -0.322162 -0.324558 -0.171745 0.025961 -0.026334 -0.000321 0.493505 -0.208940 -0.011617 0.292888 0.218883 0.073487 0.060980 0.316952 -0.122260 -0.002447 -0.073714 -0.074284 -0.086345
polarizability: 3.86475425e+02 6.61682626e+00 1.81783513e+02 1.73434250e+00 8.85406730e-01 7.09938142e+01
1716.lowfreq: -0.0023 -0.0021 -0.0006 1.4416 4.4661 5.7607 14.2142 24.3818 35.0142
frequency: 10.3507 24.0409 34.9527 39.3167 64.2510 99.1518 111.6250 133.2994 154.5600 158.1530 214.0318 259.7101 270.1528 310.9427 318.3568 344.7196 362.1635 373.8444 411.7262 428.8399 456.4600 465.9853 505.3074 509.2991 579.3354 611.8801 622.0417 655.1100 660.0475 667.3747 674.4681 696.7591 703.2993 734.4333 746.7030 812.2169 830.8387 832.6508 845.1786 876.3718 888.5242 936.3496 959.8361 962.5732 979.5565 992.6790 993.4601 1006.8317 1058.2795 1072.6370 1077.1053 1093.3620 1117.6931 1171.0109 1187.3166 1220.2494 1226.3968 1262.8496 1281.8175 1298.2948 1302.1549 1330.4711 1364.4971 1397.4379 1402.2907 1412.7222 1466.1021 1481.1645 1514.4527 1524.6458 1542.8950 1569.8344 1583.9338 1597.2196 1609.2369 1626.2633 3119.9108 3129.9893 3142.4758 3153.3771 3166.8717 3173.7581 3175.9843 3195.2428 3473.4425 3509.9780 3530.4635
redmass: 4.3389 7.2898 8.2991 5.8156 6.9125 8.5953 7.8852 7.1411 5.8443 9.4098 7.2745 5.9322 7.3087 10.8291 4.6766 6.6345 2.4544 6.7862 3.0262 8.3658 1.4349 3.8460 5.8955 2.5178 1.2605 1.1815 7.1040 7.8746 6.9740 6.8952 5.9456 3.7384 3.5895 7.1794 2.9259 1.3977 1.9486 3.6057 1.3996 6.5210 1.2655 1.3552 5.2422 1.5451 1.3136 1.4199 4.3759 4.4017 2.5009 2.6116 2.2678 1.9584 1.3319 2.3799 1.1233 1.4588 1.8037 2.0133 2.2396 1.3784 7.4572 1.4612 3.9395 2.5208 2.7657 2.9116 2.0074 2.5170 2.4821 5.2639 3.1349 8.5379 5.6547 6.0332 5.9101 4.1417 1.0905 1.0877 1.0897 1.0976 1.0910 1.0950 1.0964 1.0955 1.0790 1.0796 1.0764
irintensity: 0.2779 0.0099 1.6505 0.5285 0.0353 9.4201 1.6732 2.0476 7.8232 4.9646 13.5949 3.2515 31.8739 3.4511 0.0050 7.3227 0.3404 16.6663 0.0104 10.8819 4.1526 2.3772 9.8693 48.8290 67.8077 210.2464 1.3164 43.4026 3.9164 4.3938 64.8071 0.9589 1.3392 0.0877 15.1892 45.4941 32.2243 13.0522 65.2958 2.2023 3.5253 1.2258 3.1535 0.7639 3.4413 0.9597 39.1551 4.4912 6.2086 32.4994 25.5924 5.9533 16.2823 19.3893 5.0539 46.2392 32.4845 104.0051 78.9008 19.2564 1.0572 2.7865 2.4190 261.6310 48.9622 885.5925 69.6627 74.0270 634.1471 334.1342 304.1511 69.8428 19.5375 70.7607 23.8292 68.5449 15.7898 7.6468 27.3204 15.8977 2.3351 2.4983 5.0399 8.3609 73.9782 153.4306 24.4631
temp: 298.150 k
press: 1.00000 atm
elementType: 17 8 8 7 7 7 7 6 6 6 6 6 6 6 6 6 6 6 6 6 1 1 1 1 1 1 1 1 1 1 1
symmnumber: 1
zpe: 591515.0 jmol-1
zpe.correction: 0.225296 hartree
zpe.thermalcorrener: 0.243123 hartree
zpe.thermalcorrenthalpy: 0.244067 hartree
zpe.thermalcorrgfe: 0.175511 hartree
zpe.sumelectzpe: -1330.085379 hartree
zpe.sumelectthermal: -1330.067552 hartree
zpe.sumelectthermalent: -1330.066608 hartree
zpe.sumelectthermalfe: -1330.135164 hartree
dipole: -0.5882 2.0688 -0.0696
dipole: 2.1519
quadrupole: -156.4914 -114.4222 -127.9023
quadrupole: -6.8221 0.5692 0.4505
quadrupole: -23.5528 18.5165 5.0363 -6.8221 0.5692 0.4505
hfenergy: -1330.3106748 hartree
pointgroup: C01 [X(C13H11Cl1N4O2)]
dipole: 0.2482503 -0.8092126 0.0183493 debye
polarizability: 386.1024098|10.9194414|181.7589076|2.5003876|-6.5072802|71.391435 unknown
InChI: InChI=1S/C13H11ClN4O2/c14-10-1-3-11(4-2-10)16-13(20)18-17-12(19)9-5-7-15-8-6-9/h1-8,16-18H
charge 0 multiplicity 1
31 atoms
Cl 7.767224 0.900338 0.060512
O  -2.651722 -2.179386 0.00456
O  0.736105 1.179322 -0.072207
N  1.96822 -0.856222 0.008008
N  -1.577698 -0.155089 -0.074439
N  -0.365866 -0.850426 -0.032911
N  -6.599821 1.094091 -0.16867
C  3.311311 -0.385384 0.017389
C  4.341752 -1.363436 0.054283
C  3.652226 0.993502 -0.006947
C  -4.03455 -0.161067 -0.099147
C  -2.73478 -0.90213 -0.053946
C  5.69734 -0.979241 0.067496
C  5.010177 1.376626 0.006101
C  0.803186 -0.092152 -0.034327
C  6.015336 0.392356 0.043243
C  -5.223346 -0.921246 0.028034
C  -4.155747 1.243002 -0.267216
C  -6.468366 -0.258195 -0.010649
C  -5.446177 1.816397 -0.294868
H  1.860638 -1.872631 0.032397
H  4.090448 -2.431462 0.072799
H  2.861328 1.744835 -0.03626
H  6.487747 -1.73432 0.095972
H  5.277387 2.4371 -0.012548
H  -1.460756 0.862986 -0.093649
H  -0.500137 -1.867746 0.004846
H  -5.152262 -2.005721 0.151336
H  -3.287852 1.900843 -0.386992
H  -7.404397 -0.818626 0.086795
H  -5.572749 2.896778 -0.425094
