program: Gaussian 09
title: 000235203
version: EM64L-G09RevD.01
frameworkgroup: C1[X(C15H14N4O2)]
method: RPBEPBE
basis: SDD
operation: Freq
keyword: #p
keyword: freq=noraman
keyword: PBEPBE/SDD
title: #p freq=noraman PBEPBE/SDD
converged: YES YES NO NO
title: Mulliken charges:
elementType: O O N N N N C C C C C C C C C C C C C C C H H H H H H H H H H H H H H
charge: -0.155515 -0.235695 -0.012849 -0.600349 -0.617413 -0.009719 -0.302876 -0.356331 -0.241362 0.189675 -0.126647 -0.035788 0.219207 -0.359345 -0.171953 0.492684 -0.391867 -0.396865 -0.234875 -0.238935 -0.239899 0.253026 0.264435 0.337221 0.253928 0.221220 0.326943 0.348929 0.347360 0.324665 0.230892 0.228375 0.229279 0.228734 0.231706
chargesum: 0.00000
title: Mulliken charges with hydrogens summed into heavy atoms:
elementType: O O N N N N C C C C C C C C C C C C C C C
charge: -0.155515 -0.235695 -0.012849 0.075523 0.054613 -0.009719 -0.049850 -0.091896 0.095860 0.189675 0.127280 -0.035788 0.219207 -0.138124 -0.171953 0.492684 -0.160975 -0.168489 -0.005595 -0.010201 -0.008194
polarizability: 2.59235216e+02 -8.31646614e+00 1.77256830e+02 5.17014755e+00 4.40283310e+00 1.66384713e+02
1716.lowfreq: -4.2394 -2.9050 -0.0007 -0.0006 0.0005 7.2028 19.7809 23.1198 30.9509
frequency: 19.5294 23.1016 30.8635 36.5975 47.2108 76.0905 85.3013 117.1568 137.2613 142.1044 163.1298 194.0992 225.3823 254.7033 288.3225 332.2621 336.0936 360.8482 386.3479 402.7463 413.4492 453.3398 456.9646 500.0687 506.1059 523.9946 536.5868 562.8780 571.7246 592.9726 613.1324 616.1098 632.7410 656.2738 695.0592 699.5251 709.9444 747.4297 766.6778 815.5485 831.9105 846.4680 857.5079 888.5700 906.3793 926.0933 975.1733 977.7825 981.9745 989.2204 999.5852 1013.5465 1026.8618 1035.3364 1048.8255 1054.4863 1082.3136 1103.6701 1173.8038 1190.0511 1194.7263 1203.5691 1218.4074 1224.0665 1230.1408 1266.7500 1292.6148 1305.3933 1320.6103 1328.8025 1336.9958 1357.1102 1382.4035 1389.4324 1441.7077 1486.2263 1572.2858 1585.7177 1595.0881 1605.5808 1612.6090 1642.4675 1645.5060 1663.4297 2205.7892 2968.6831 3004.8488 3023.0926 3075.5041 3099.5391 3118.6135 3128.1450 3139.9328 3150.7476 3166.6284 3506.0878 3517.7440 3659.8946 3672.8385
redmass: 4.1092 6.0560 5.8970 5.0561 10.0921 5.3927 4.8360 7.5869 5.6693 6.1476 7.5451 5.2197 4.2197 3.6538 4.1139 4.7222 5.2708 5.1360 5.6401 2.7943 5.5877 1.9028 2.2350 3.1507 1.5677 1.8001 4.0545 4.5730 2.9272 4.5596 2.9027 6.2267 1.6753 1.9664 2.0853 3.2803 3.7001 5.6937 1.8266 4.8658 4.4466 1.4178 2.4102 2.5788 3.0186 1.5380 4.0137 1.3469 1.2329 5.5500 1.3199 3.1148 2.2019 3.4743 2.2328 1.9296 1.8273 2.9075 1.0622 1.3721 1.2041 1.4470 1.8235 1.5328 1.7760 1.6949 1.2786 1.3671 1.6934 1.6728 1.9291 1.5953 4.2095 4.6488 2.2515 2.2972 3.3946 5.7518 1.6060 1.9937 5.9594 3.2079 3.3356 6.0601 12.5797 1.0806 1.0842 1.0862 1.0906 1.0884 1.0873 1.0860 1.0912 1.0962 1.1016 1.0452 1.0455 1.1042 1.1044
irintensity: 2.1166 4.8454 4.7051 2.1568 1.0444 0.8354 0.8801 3.5096 0.9311 3.8279 0.3890 13.9133 1.7556 1.6625 3.8707 0.2944 2.4415 1.0466 5.0425 0.0316 1.3497 43.7286 29.6167 25.8862 41.4069 66.7576 23.9305 15.5119 64.3896 7.1344 74.8017 2.3025 90.0371 61.4457 18.3189 26.6804 12.6776 13.8976 67.4093 1.2438 0.1729 0.5405 1.0700 3.8048 3.9322 0.0483 18.7880 3.7696 22.1281 1.5805 2.5671 63.3179 5.3479 34.3381 12.4511 0.8354 9.8685 3.0720 0.4308 22.1762 14.2658 32.0436 87.3796 37.0028 16.2506 24.8684 10.5057 7.1597 45.5789 80.2012 130.4585 19.7374 94.4594 2.9278 9.5613 14.2193 407.4692 2.5858 49.2847 360.2702 0.9476 293.0355 189.7355 8.7578 13.7994 10.8837 18.4583 9.5803 14.6422 14.9061 9.8492 0.8690 10.7716 37.7684 24.8163 52.5681 97.0910 29.6409 37.4099
temp: 298.150 k
press: 1.00000 atm
elementType: 8 8 7 7 7 7 6 6 6 6 6 6 6 6 6 6 6 6 6 6 6 1 1 1 1 1 1 1 1 1 1 1 1 1 1
symmnumber: 1
zpe: 699689.6 jmol-1
zpe.correction: 0.266498 hartree
zpe.thermalcorrener: 0.286002 hartree
zpe.thermalcorrenthalpy: 0.286946 hartree
zpe.thermalcorrgfe: 0.215397 hartree
zpe.sumelectzpe: -947.947860 hartree
zpe.sumelectthermal: -947.928356 hartree
zpe.sumelectthermalent: -947.927412 hartree
zpe.sumelectthermalfe: -947.998961 hartree
dipole: 0.5536 -12.5506 2.2675
dipole: 12.7658
quadrupole: -108.8724 -128.4512 -121.3478
quadrupole: -19.2018 5.0032 5.1450
quadrupole: 10.6848 -8.8941 -1.7907 -19.2018 5.0032 5.1450
hfenergy: -948.2143582 hartree
pointgroup: C01 [X(C15H14N4O2)]
dipole: 0.0565773 4.9443178 -0.8805976 debye
polarizability: 258.0843017|-13.8005356|174.2790043|-0.2647826|-7.097395|170.513453 unknown
InChI: InChI=1S/C15H14N4O2/c16-8-11-10(7-6-9-4-2-1-3-5-9)12(14(18)20)13(17)19-15(11)21/h1-7,10-12H,17-18H2
charge 0 multiplicity 1
35 atoms
O  -1.595951 -2.333854 2.009123
O  -3.859112 0.595567 -1.514041
N  -2.420858 -0.159171 1.850169
N  -3.123411 2.038352 1.70828
N  -2.914416 2.679291 -1.91031
N  -0.48797 -3.482545 -1.217495
C  -0.949734 -0.010151 -0.660164
C  -1.842179 1.205808 -0.230806
C  -1.711104 -1.329683 -0.251032
C  -2.470109 0.965071 1.156618
C  0.431461 0.077176 -0.044245
C  -1.883364 -1.342063 1.298039
C  -2.963191 1.453331 -1.266492
C  1.576781 0.140054 -0.780214
C  -1.033184 -2.524812 -0.762491
C  2.961909 0.22215 -0.274545
C  3.292199 0.157223 1.110029
C  4.022229 0.368957 -1.212657
C  4.632391 0.24553 1.534442
C  5.364946 0.457664 -0.788583
C  5.67621 0.39866 0.588936
H  -0.853735 -0.000202 -1.761699
H  -1.194137 2.100843 -0.163771
H  -2.725413 -1.269195 -0.700369
H  0.474705 0.073684 1.054545
H  1.481322 0.124684 -1.877508
H  -3.229703 2.921608 1.213588
H  -3.582863 1.904126 2.609744
H  -3.614643 2.875461 -2.627514
H  -2.143167 3.333186 -1.783794
H  2.502769 0.020514 1.857269
H  3.786779 0.408053 -2.283736
H  4.868516 0.186619 2.602778
H  6.165522 0.567139 -1.528432
H  6.71741 0.462823 0.923539
