program: Gaussian 09
title: 000235202
version: EM64L-G09RevD.01
frameworkgroup: C1[X(C13H17NO4)]
method: RPBEPBE
basis: SDD
operation: Freq
keyword: #p
keyword: freq=noraman
keyword: PBEPBE/SDD
title: #p freq=noraman PBEPBE/SDD
converged: YES YES NO NO
title: Mulliken charges:
elementType: O O O O N C C C C C C C C C C C C C H H H H H H H H H H H H H H H H H
charge: -0.195990 -0.201712 -0.217782 -0.217307 -0.359141 -0.278797 -0.091096 -0.431897 -0.554277 -0.410189 0.186650 -0.394689 -0.513155 0.194963 -0.522030 -0.528087 0.141233 0.153622 0.250085 0.264187 0.234099 0.234575 0.294671 0.239601 0.194113 0.225071 0.220338 0.216939 0.221244 0.250838 0.248700 0.285658 0.259808 0.251780 0.347974
chargesum: 0.00000
title: Mulliken charges with hydrogens summed into heavy atoms:
elementType: O O O O N C C C C C C C C C C C C C
charge: -0.195990 -0.201712 -0.217782 -0.217307 -0.011167 -0.028712 0.173092 0.036777 -0.020006 0.008995 0.186650 0.042588 -0.041073 0.194963 0.012328 -0.016499 0.141233 0.153622
polarizability: 1.60359115e+02 -1.13022900e+01 1.57654357e+02 -3.88871191e+00 8.60789311e-01 1.28409373e+02
1716.lowfreq: -14.2972 -10.4154 -4.0483 -0.0012 -0.0010 -0.0006 14.6583 25.2806 41.1201
frequency: 14.3901 24.9763 41.0693 63.6251 65.3789 104.5066 117.1639 137.2804 160.4670 186.0692 226.9252 260.4590 293.8550 310.8897 335.2551 369.3845 399.7138 427.0343 441.6387 459.3917 468.1545 506.7772 512.9560 529.4991 550.8688 590.8998 642.9271 647.3653 716.0448 729.7549 797.2591 814.6735 825.3025 843.4260 851.4810 867.8015 870.6002 886.4534 917.2336 923.1890 952.6645 959.0769 979.1677 1028.4507 1046.1477 1060.3466 1079.7055 1089.4838 1102.0499 1114.5215 1130.6408 1140.4771 1160.6799 1198.0642 1221.5219 1228.6438 1243.7544 1252.9051 1262.5752 1267.1113 1273.2031 1297.5620 1302.5693 1313.7327 1325.6078 1335.7349 1340.0675 1345.1077 1346.5955 1369.6957 1370.7080 1436.5824 1440.0867 1443.5447 1453.2188 1465.2117 1466.6494 1477.4217 1615.8115 1623.4144 1637.4229 1642.0266 2942.1695 2962.2289 2970.0641 2972.5675 2986.0723 2989.4963 2989.6333 3006.7385 3011.4354 3041.6200 3043.1192 3052.6925 3069.8678 3075.4038 3076.4254 3093.9842 3480.2402
redmass: 4.7054 5.0779 7.0683 7.6781 5.3874 4.3448 3.4077 5.3115 3.8724 4.2804 3.2838 3.4746 1.8390 3.2014 3.7443 4.5123 2.7637 3.4199 3.6397 4.0446 2.1855 5.0629 4.8340 2.5592 3.8972 3.3048 3.0199 4.6739 2.8174 3.6782 1.4356 1.7784 2.6640 3.0242 2.0560 2.3448 3.0920 1.4804 2.2610 2.6151 2.6958 2.1481 2.7372 1.8673 1.4169 1.6508 1.9669 1.5348 1.8150 2.5740 2.1336 1.3740 1.3202 1.4074 1.5359 1.6108 1.6036 1.5982 1.3802 1.3471 1.9878 2.0165 1.4958 1.8310 1.9724 1.4951 1.4285 1.6141 1.4810 1.6157 1.7254 1.1022 1.0808 1.0906 1.0790 1.0851 1.0855 1.0878 8.7680 9.8590 11.1191 5.4847 1.0791 1.0613 1.0655 1.0646 1.0664 1.0670 1.0630 1.0627 1.0955 1.0952 1.0866 1.1021 1.1029 1.0946 1.0969 1.0926 1.0759
irintensity: 1.6507 2.3726 1.0574 3.4569 1.5653 1.9246 3.9270 5.3957 2.0572 11.4051 0.5679 3.1259 0.2012 2.8709 8.6144 15.2390 1.0096 2.3576 8.5690 4.2103 0.9595 4.8823 12.4626 3.5164 18.6301 6.4125 6.7102 6.1777 3.8504 4.0533 55.0276 61.9781 16.3661 0.4445 4.1168 5.1749 2.2805 5.9627 6.4629 5.4710 14.3268 3.8878 1.2873 17.6762 9.9784 1.5866 7.9847 9.2300 1.7288 26.8973 47.4332 104.0491 21.9754 1.7638 0.9932 40.6098 43.2443 28.5776 21.3048 36.9593 134.6560 29.5626 35.7529 42.4681 56.6488 10.9897 0.8196 67.3140 3.3418 20.4291 6.4977 23.5428 10.3919 14.5032 16.6213 15.4686 12.6775 6.5369 125.3688 91.6449 128.8881 448.9135 3.7063 3.2901 11.5166 32.0755 14.2356 34.8487 13.3680 10.4304 6.1965 45.6383 18.1162 39.8032 24.9377 8.1718 23.3420 3.1274 33.5882
temp: 298.150 k
press: 1.00000 atm
elementType: 8 8 8 8 7 6 6 6 6 6 6 6 6 6 6 6 6 6 1 1 1 1 1 1 1 1 1 1 1 1 1 1 1 1 1
symmnumber: 1
zpe: 744889.9 jmol-1
zpe.correction: 0.283714 hartree
zpe.thermalcorrener: 0.300781 hartree
zpe.thermalcorrenthalpy: 0.301725 hartree
zpe.thermalcorrgfe: 0.236205 hartree
zpe.sumelectzpe: -859.900324 hartree
zpe.sumelectthermal: -859.883256 hartree
zpe.sumelectthermalent: -859.882312 hartree
zpe.sumelectthermalfe: -859.947832 hartree
dipole: 3.8229 -0.5804 -0.4513
dipole: 3.8929
quadrupole: -99.3935 -126.8841 -107.4227
quadrupole: 0.7945 -16.4793 -1.1608
quadrupole: 11.8399 -15.6507 3.8107 0.7945 -16.4793 -1.1608
hfenergy: -860.1840374 hartree
pointgroup: C01 [X(C13H17N1O4)]
dipole: 1.4491882 -0.4955777 0.0073158 debye
polarizability: 156.9307088|-12.4544534|151.9527662|1.745774|-14.0681845|137.5393703 unknown
InChI: InChI=1S/C13H17NO4/c15-10-4-2-1-3-9(10)11(16)5-8-6-12(17)14-13(18)7-8/h8-9,14H,1-7H2
charge 0 multiplicity 1
35 atoms
O  0.508797 -0.057269 2.026111
O  2.172112 1.710451 -0.83452
O  -3.479946 -2.300589 0.080531
O  -3.981885 1.725729 -2.153398
N  -3.698245 -0.247388 -0.971059
C  1.708529 -0.585723 -0.029595
C  -1.860166 0.963684 0.807877
C  2.684883 -1.397249 0.873963
C  -0.597269 0.653833 -0.028855
C  3.863643 -1.979409 0.066712
C  0.52693 -0.003227 0.767072
C  4.648054 -0.864515 -0.658428
C  3.710905 -0.031535 -1.579085
C  2.495055 0.493548 -0.823209
C  -2.596808 -0.323023 1.25875
C  -2.847303 1.867041 0.030018
C  -3.274663 -1.058418 0.109886
C  -3.543483 1.151488 -1.122752
H  1.292762 -1.275973 -0.79812
H  -1.529791 1.49586 1.717873
H  2.114589 -2.198052 1.377676
H  3.059201 -0.734027 1.675957
H  -0.159826 1.592178 -0.431489
H  -0.831184 0.033416 -0.918281
H  3.486542 -2.711521 -0.677165
H  4.537914 -2.534497 0.745662
H  5.46714 -1.291039 -1.266533
H  5.115229 -0.192434 0.087959
H  3.347378 -0.687442 -2.398096
H  4.236703 0.82466 -2.034945
H  -3.383133 -0.063835 1.99669
H  -1.917035 -1.02774 1.762925
H  -2.354117 2.76058 -0.389038
H  -3.640117 2.232548 0.71425
H  -4.176096 -0.733912 -1.740642
