program: Gaussian 09
title: 000235201
version: EM64L-G09RevD.01
frameworkgroup: C1[X(C15H19NO6)]
method: RPBEPBE
basis: SDD
operation: Freq
keyword: #p
keyword: freq=noraman
keyword: PBEPBE/SDD
title: #p freq=noraman PBEPBE/SDD
converged: YES YES NO NO
title: Mulliken charges:
elementType: O O O O O O N C C C C C C C C C C C C C C C H H H H H H H H H H H H H H H H H H H
charge: -0.273363 -0.189459 -0.195723 -0.214472 -0.217043 -0.244092 -0.359756 -0.298901 -0.480203 0.010587 -0.091278 -0.452441 -0.559192 -0.526108 0.190538 0.191913 -0.522100 -0.528409 0.141747 0.153123 0.294096 -0.763774 0.265209 0.251807 0.265521 0.237176 0.263192 0.234482 0.233757 0.296335 0.242663 0.231985 0.259562 0.249932 0.287403 0.259472 0.252515 0.348789 0.251235 0.254135 0.249135
chargesum: 0.00000
title: Mulliken charges with hydrogens summed into heavy atoms:
elementType: O O O O O O N C C C C C C C C C C C C C C C
charge: -0.273363 -0.189459 -0.195723 -0.214472 -0.217043 -0.244092 -0.010966 -0.033692 0.037125 0.247764 0.171914 0.015799 -0.020194 -0.034560 0.190538 0.191913 0.015236 -0.016421 0.141747 0.153123 0.294096 -0.009269
polarizability: 2.04871940e+02 -2.27671055e+01 1.85825578e+02 4.88132156e+00 -2.26787849e+00 1.45601062e+02
1716.lowfreq: -34.0748 -5.7811 -0.0008 -0.0005 0.0004 2.1828 6.9654 13.1080 20.5135
frequency: -34.0627 12.0830 20.4442 36.1375 41.6311 54.4300 62.0951 69.0810 90.0594 107.7257 128.6800 139.1508 159.5028 184.1845 213.6170 228.0643 255.1300 274.0486 307.4348 337.4356 343.2056 376.7893 402.1721 426.7366 441.8607 456.7320 479.1260 489.0820 511.3304 514.7144 531.2137 553.9951 579.9384 590.5684 613.2570 645.6672 676.1656 714.1706 732.3098 799.2407 816.3942 826.4641 840.0935 850.7947 870.4249 871.2936 899.6523 916.8436 940.8733 949.2918 956.7820 977.1416 991.3451 1001.5762 1027.2324 1046.6724 1057.4489 1065.0243 1082.9009 1095.9528 1114.5257 1126.6937 1140.8461 1157.6925 1168.4813 1191.2769 1220.3921 1223.6598 1233.2656 1244.1539 1254.8041 1266.9403 1272.6975 1295.4799 1298.2069 1306.9657 1315.5943 1324.1211 1327.2896 1345.1682 1352.1845 1364.4780 1369.2123 1370.3279 1386.6129 1435.5100 1441.8894 1444.7390 1453.9138 1455.8367 1457.8084 1463.9906 1479.9130 1620.3559 1627.6578 1638.4375 1642.3900 1644.9241 2942.9881 2961.7033 2969.4138 2986.5602 2992.4230 3002.3952 3009.2570 3010.2933 3011.1249 3024.8761 3040.4209 3073.4181 3076.6623 3082.0753 3090.6842 3094.5150 3097.2119 3140.4402 3479.9378
redmass: 1.0782 5.9880 7.3008 6.2297 8.3773 8.4569 4.5475 5.3956 3.6506 3.9827 4.1858 5.2941 4.0658 4.1265 4.0222 3.5110 3.4106 4.6916 2.8130 4.1198 5.2129 3.5461 2.9099 3.2278 4.0482 3.0448 3.2261 3.5953 5.2838 4.4124 2.5384 3.8311 3.3416 3.3026 5.3265 4.7895 3.7140 3.3398 3.3572 1.4460 1.9611 2.8080 4.7092 3.2121 2.9827 2.5259 1.4667 2.1756 2.7061 3.2782 2.5369 2.6394 2.7449 2.0854 2.7457 1.6238 1.5826 1.2079 1.8481 1.9287 2.9005 2.1117 1.3606 2.0059 1.4637 3.5603 1.4186 1.4549 1.8368 1.4367 1.5393 1.3474 2.0365 1.3175 1.7546 1.5616 1.8089 1.5635 2.0353 1.6037 1.5419 1.4699 1.8119 1.5656 1.2322 1.1016 1.0803 1.0851 1.0798 1.0693 1.0463 1.0830 1.0893 8.7764 10.1045 11.5892 5.5231 10.3321 1.0791 1.0611 1.0666 1.0665 1.0684 1.0803 1.0367 1.0955 1.0641 1.0611 1.0865 1.1011 1.0946 1.0968 1.1036 1.0928 1.0970 1.1012 1.0760
irintensity: 1.5789 0.1271 0.7390 0.9021 4.3715 2.3230 2.8449 3.1556 0.8665 2.0982 5.1288 4.6046 3.0428 8.4913 1.5256 1.3817 8.5329 2.5806 1.1094 9.5644 10.9119 17.3899 2.8897 0.7461 10.1514 13.7918 2.7758 4.7570 5.4317 8.3560 3.1746 15.5779 3.1115 6.5715 2.0426 10.3669 7.9783 4.1714 5.6333 60.6447 51.8218 18.7850 17.0898 2.3660 1.1307 7.2388 5.9289 3.7565 14.7787 36.5970 14.4006 18.4629 27.6078 82.0225 19.7382 9.7684 9.1958 7.1398 2.4663 6.0413 61.5028 22.3326 109.4446 2.0156 19.0432 394.3979 6.6012 19.6039 84.0854 10.4987 26.6068 42.8219 119.5423 10.8364 29.8485 21.6002 30.9837 18.2844 71.0870 72.0812 3.5542 6.0963 17.9359 13.9941 47.8518 23.3039 10.2740 17.0144 16.7733 14.5789 17.0955 14.8835 7.5881 126.7615 103.2383 105.7492 418.5236 213.5095 3.6868 3.6368 11.7965 14.5081 13.7709 6.2050 2.0125 3.6596 24.1582 9.6570 17.4447 25.0960 8.2389 12.0846 8.7104 2.9510 5.8392 8.0143 34.5162
temp: 298.150 k
press: 1.00000 atm
elementType: 8 8 8 8 8 8 7 6 6 6 6 6 6 6 6 6 6 6 6 6 6 6 1 1 1 1 1 1 1 1 1 1 1 1 1 1 1 1 1 1 1
symmnumber: 1
zpe: 850833.5 jmol-1
zpe.correction: 0.324065 hartree
zpe.thermalcorrener: 0.345141 hartree
zpe.thermalcorrenthalpy: 0.346085 hartree
zpe.thermalcorrgfe: 0.270357 hartree
zpe.sumelectzpe: -1087.469370 hartree
zpe.sumelectthermal: -1087.448295 hartree
zpe.sumelectthermalent: -1087.447351 hartree
zpe.sumelectthermalfe: -1087.523078 hartree
dipole: 4.1545 1.9491 0.7469
dipole: 4.6493
quadrupole: -122.8268 -148.3996 -130.8360
quadrupole: 6.6712 -11.2887 -7.7347
quadrupole: 11.1940 -14.3788 3.1848 6.6712 -11.2887 -7.7347
hfenergy: -1087.7934354 hartree
pointgroup: C01 [X(C15H19N1O6)]
dipole: -1.8094402 -0.187256 0.1918114 debye
polarizability: 187.3085239|-21.8051649|197.4971404|-8.7587259|18.0815058|151.4929153 unknown
InChI: InChI=1S/C15H19NO6/c1-8(17)22-10-2-3-12(18)11(7-10)13(19)4-9-5-14(20)16-15(21)6-9/h9-11,16H,2-7H2,1H3
charge 0 multiplicity 1
41 atoms
O  -4.059827 1.780483 0.469156
O  0.380458 -0.327772 1.894829
O  -1.126114 -2.700749 -0.549406
O  4.347943 1.785498 -0.263477
O  5.020183 -2.482518 -1.932343
O  -2.913826 3.710522 -0.174425
N  4.647361 -0.379763 -1.031143
C  -0.853837 -0.262892 -0.20605
C  -1.850085 0.670266 0.539703
C  -3.093269 0.954508 -0.319292
C  2.810699 -1.408366 0.862287
C  -3.836417 -0.332333 -0.696049
C  1.555031 -1.266512 -0.028865
C  -2.885795 -1.285641 -1.466842
C  0.376464 -0.591014 0.663692
C  -1.578454 -1.539877 -0.719702
C  3.486697 -0.043551 1.146343
C  3.846662 -2.369509 0.231635
C  4.174038 0.553113 -0.075382
C  4.54164 -1.790364 -0.996366
C  -3.845869 3.168707 0.462222
C  -4.877268 3.878588 1.309574
H  -0.494296 0.259601 -1.121342
H  -2.153561 0.195237 1.489897
H  -1.337872 1.613595 0.793737
H  -2.807636 1.534314 -1.219644
H  2.481433 -1.826383 1.830746
H  -4.71838 -0.097086 -1.317493
H  -4.201654 -0.823625 0.224959
H  1.183739 -2.267929 -0.33426
H  1.77967 -0.731791 -0.974775
H  -2.628404 -0.828549 -2.445985
H  -3.36588 -2.257544 -1.669025
H  4.258416 -0.16459 1.933398
H  2.766088 0.696374 1.528871
H  3.395577 -3.330307 -0.06932
H  4.636397 -2.607022 0.973292
H  5.12805 0.016905 -1.849079
H  -4.37073 4.389978 2.146952
H  -5.62404 3.176177 1.70592
H  -5.374931 4.656921 0.706149
