program: Gaussian 09
title: 000235200
version: EM64L-G09RevD.01
frameworkgroup: C1[X(C13H15NO5S)]
method: RPBEPBE
basis: SDD
operation: Freq
keyword: #p
keyword: freq=noraman
keyword: PBEPBE/SDD
title: #p freq=noraman PBEPBE/SDD
converged: YES YES NO NO
title: Mulliken charges:
elementType: S O O O O O N C C C C C C C C C C C C C H H H H H H H H H H H H H H H
charge: 0.200639 -0.448518 -0.209104 -0.276499 -0.437024 -0.214686 -0.435740 -0.131331 -0.363167 -0.702182 0.134681 0.160773 0.255340 -0.749416 -0.350716 -0.380021 -0.222208 -0.249674 -0.224280 0.289471 0.308627 0.248091 0.276215 0.273409 0.301908 0.356498 0.279050 0.289219 0.278177 0.237565 0.393918 0.236320 0.236199 0.236366 0.402101
chargesum: 0.00000
title: Mulliken charges with hydrogens summed into heavy atoms:
elementType: S O O O O O N C C C C C C C C C C C C C
charge: 0.200639 -0.054600 -0.209104 -0.276499 -0.034924 -0.214686 -0.079242 0.177296 0.161139 -0.126865 0.134681 0.160773 0.255340 -0.181147 -0.072538 -0.142456 0.014112 -0.013474 0.012085 0.289471
polarizability: 2.18215892e+02 -2.56161571e+01 1.62856957e+02 4.45211114e+00 -5.69954830e+00 1.56240268e+02
1716.lowfreq: -7.5748 -1.7901 -0.0015 -0.0011 0.0003 9.4649 18.2590 22.0349 38.5295
frequency: 18.1146 21.5336 38.5274 42.7909 46.4443 58.4438 60.2181 72.4744 87.7538 113.4271 157.1991 177.9046 180.3064 210.5438 227.2006 237.5672 269.6451 315.4692 321.7604 401.8651 403.8177 407.1255 432.0072 490.7303 508.3716 535.7006 558.4662 578.2552 594.6337 615.0929 618.3867 657.8460 661.6508 682.7757 688.8973 707.7459 732.5380 747.1597 766.2575 796.6023 807.1883 829.6293 860.3749 874.5233 882.9542 914.6785 939.9714 987.5520 988.5189 990.1316 1008.5567 1024.9301 1047.2953 1065.1665 1072.5107 1079.9042 1092.7341 1147.0806 1169.6300 1174.8652 1179.8281 1191.4995 1222.6832 1237.4047 1245.2563 1275.3499 1284.6089 1293.5330 1302.4155 1319.1953 1330.6974 1351.1062 1383.7662 1424.2810 1432.7579 1453.1595 1464.4137 1469.1942 1490.6683 1565.6256 1600.0308 1609.9224 1671.3219 1677.5683 3007.1543 3019.0852 3025.6656 3059.4612 3083.9854 3107.7387 3123.0525 3135.3862 3146.5164 3147.4335 3159.7710 3171.6080 3501.6159 3526.5409 3559.3922
redmass: 9.5913 5.9539 7.6368 5.9224 8.3440 6.2831 7.2550 6.3690 6.7435 4.3715 4.9704 2.9262 4.7862 4.3621 4.9938 8.0387 4.8622 7.3954 4.3657 2.3791 2.9262 4.6108 5.0379 3.5927 4.6308 3.5110 3.7094 2.8281 1.2554 5.5159 1.7198 3.7562 1.7511 3.5197 4.7408 1.5785 5.8654 3.6719 1.4685 2.3327 4.0732 5.4391 1.2629 4.7860 1.9431 2.8331 1.4284 1.5992 2.4829 2.7742 1.3440 2.3473 2.0041 2.8360 1.7982 1.8397 2.5694 2.4837 1.2172 1.0596 1.3026 1.1439 1.2713 1.1923 1.4979 1.3248 1.5106 2.0184 1.4942 1.3359 1.9007 1.3411 9.0756 1.1098 2.2197 1.0904 1.9888 1.0938 2.3825 6.8919 6.8487 6.0134 8.9735 9.1634 1.0798 1.0598 1.0612 1.0582 1.1029 1.1068 1.0872 1.0875 1.1075 1.0923 1.0956 1.1008 1.0644 1.0644 1.0779
irintensity: 0.6383 0.0850 3.7095 0.3967 0.4554 2.7928 0.5106 0.1001 3.4269 0.3500 2.3354 1.1743 0.3574 2.2277 5.8149 2.6835 7.6956 4.0652 1.3902 3.4975 1.9998 3.9575 4.1959 18.5800 24.4589 61.1068 29.9919 53.3520 80.0723 3.7586 102.2246 9.0376 111.1663 49.1280 4.4598 124.9680 6.6218 4.8479 16.1433 17.7941 6.2178 23.0700 0.9167 17.4944 5.7079 27.2518 11.5122 0.2131 37.5369 27.4949 2.6349 3.8210 158.9368 146.1082 55.2965 11.5932 53.9936 3.6813 27.9637 0.6665 19.1122 13.1467 2.0745 5.2509 20.6853 2.0808 3.2053 73.8548 21.4153 4.5683 25.9274 4.3905 1.4488 24.1517 6.7253 1.8176 267.5016 29.8551 164.1173 89.5135 37.8124 4.9221 307.1401 221.6075 7.7106 25.0190 12.5820 8.8962 2.8157 7.3817 7.1721 2.1013 0.6861 19.0270 11.9816 20.1325 48.2242 36.2340 50.2165
temp: 298.150 k
press: 1.00000 atm
elementType: 16 8 8 8 8 8 7 6 6 6 6 6 6 6 6 6 6 6 6 6 1 1 1 1 1 1 1 1 1 1 1 1 1 1 1
symmnumber: 1
zpe: 696538.5 jmol-1
zpe.correction: 0.265297 hartree
zpe.thermalcorrener: 0.285664 hartree
zpe.thermalcorrenthalpy: 0.286608 hartree
zpe.thermalcorrgfe: 0.212199 hartree
zpe.sumelectzpe: -1331.855959 hartree
zpe.sumelectthermal: -1331.835592 hartree
zpe.sumelectthermalent: -1331.834648 hartree
zpe.sumelectthermalfe: -1331.909057 hartree
dipole: -2.3221 -1.4116 -5.8894
dipole: 6.4861
quadrupole: -117.0934 -135.4034 -122.1573
quadrupole: 0.2325 -3.5985 -0.7823
quadrupole: 7.7912 -10.5187 2.7274 0.2325 -3.5985 -0.7823
hfenergy: -1332.1212561 hartree
pointgroup: C01 [X(C13H15N1O5S1)]
dipole: 0.7705442 0.3716923 2.4041461 debye
polarizability: 176.6727711|34.1790009|206.1523634|-1.4570737|4.9657094|154.4879823 unknown
InChI: InChI=1S/C13H15NO5S/c15-11(16)8-20-7-6-10(13(18)19)14-12(17)9-4-2-1-3-5-9/h1-5,10,14-15,18H,6-8H2
charge 0 multiplicity 1
35 atoms
S  -3.709825 -0.404632 -0.799827
O  0.155911 -2.909464 2.149304
O  -0.706148 -4.539159 0.732452
O  1.473746 -0.712038 -1.913675
O  -1.414268 1.869586 0.282685
O  -2.644664 3.043073 -1.309975
N  0.785416 -1.230259 0.238382
C  0.01545 -2.389352 -0.227242
C  -1.352066 -1.971125 -0.870719
C  -2.262142 -1.229595 0.121385
C  -0.214314 -3.404135 0.883674
C  1.446681 -0.423667 -0.672856
C  2.124347 0.8053 -0.123757
C  -3.73674 1.295443 0.056259
C  3.138153 1.401683 -0.916526
C  1.76565 1.404505 1.113921
C  3.801813 2.563107 -0.470465
C  2.42976 2.570108 1.557528
C  3.452512 3.148683 0.769995
C  -2.599961 2.17198 -0.418472
H  0.591029 -2.89386 -1.028097
H  -1.842323 -2.88004 -1.264059
H  -1.110285 -1.317292 -1.726212
H  -2.692594 -1.903558 0.881637
H  -1.706133 -0.414288 0.61163
H  0.875724 -1.089702 1.245618
H  -3.701127 1.14162 1.1451
H  -4.695503 1.745982 -0.238389
H  3.378315 0.939491 -1.879527
H  0.953798 0.989937 1.723326
H  -0.021246 -3.599328 2.843847
H  4.587053 3.013536 -1.087019
H  2.144417 3.029691 2.510098
H  3.966172 4.052322 1.115986
H  -0.652411 2.396146 -0.085312
