program: Gaussian 09
title: 000235198
version: EM64L-G09RevD.01
frameworkgroup: C1[X(C12H12N6)]
method: RPBEPBE
basis: SDD
operation: Freq
keyword: #pfreq=noraman
keyword: PBEPBE/SDD
title: #p freq=noraman PBEPBE/SDD
converged: NO YES NO NO
title: Mulliken charges:
elementType: N N N N N N C C C C C C C C C C C C H H H H H H H H H H H H
charge: -0.141798 -0.083854 -0.049463 -0.069214 -0.372690 -0.500800 -0.578645 0.156475 -0.096256 0.499394 -0.218025 0.151760 -0.359058 -0.417180 -0.228525 -0.221720 -0.373608 -0.233598 0.226530 0.260623 0.264924 0.270416 0.227235 0.229823 0.228256 0.242033 0.348288 0.231550 0.303621 0.303504
chargesum: 0.00000
title: Mulliken charges with hydrogens summed into heavy atoms:
elementType: N N N N N N C C C C C C C C C C C C
charge: -0.141798 -0.083854 -0.049463 -0.069214 -0.024402 0.106325 -0.091491 0.156475 -0.096256 0.499394 0.046899 0.151760 -0.088642 -0.189944 0.001298 0.006535 -0.131575 -0.002048
polarizability: 2.28022027e+02 -1.99807172e+01 1.63135667e+02 -1.17695652e+00 -1.85983939e+00 1.10769562e+02
1716.lowfreq: -2.3692 -0.0009 -0.0007 -0.0004 6.3590 8.3909 19.1171 35.2441 37.2533
frequency: 18.5614 35.2243 37.2258 85.0833 137.7917 142.6039 164.5717 183.5428 205.7082 227.8814 275.4796 321.7571 324.6568 367.3394 404.4495 459.2008 498.3624 531.6445 551.2614 581.0007 596.5089 617.0089 642.8926 651.9698 668.6291 703.4407 719.1077 732.2115 781.1852 790.7684 804.7280 811.6857 826.1862 859.0060 860.0404 925.8527 926.9856 951.6713 976.6069 983.6072 989.9422 1002.4568 1027.1562 1079.9023 1104.7500 1130.3618 1172.8585 1174.6582 1191.0429 1203.3933 1216.2463 1237.3367 1289.2228 1298.2423 1311.8001 1315.5730 1338.4601 1361.5080 1368.9138 1373.4736 1386.1666 1417.1661 1435.3772 1444.3873 1458.7929 1478.4564 1486.7803 1542.2096 1592.7320 1595.9509 1615.3243 1682.1142 3019.6992 3079.7643 3112.9885 3124.5312 3135.1418 3147.8256 3163.8381 3164.6322 3230.6126 3387.2021 3500.0790 3569.3219
redmass: 4.7437 5.9344 4.2633 5.6240 3.0006 3.5914 1.4511 4.3658 4.9499 5.0815 5.3928 6.4447 2.5238 3.3251 2.8267 3.7616 8.1015 5.6567 3.6995 1.1328 4.4355 6.3471 5.0763 6.2352 7.3681 3.0361 1.8173 3.1006 2.9601 4.0630 2.7605 2.4927 2.3379 6.4080 1.2475 1.5243 1.4332 1.8163 4.8889 1.3810 6.2086 1.3216 2.2475 1.8265 3.5441 2.8177 2.0579 1.1463 1.1439 2.4263 2.6092 2.2300 1.1503 6.8310 3.6240 2.1336 1.4739 1.7955 2.9639 1.6038 5.7523 2.5442 2.1382 2.1852 1.3787 2.5658 2.1490 7.5847 6.7406 6.0782 5.9957 1.0631 1.0593 1.1050 1.0883 1.0872 1.0912 1.0959 1.0921 1.1014 1.0983 1.0427 1.0985 1.0791
irintensity: 0.1096 0.2622 0.3316 0.8253 4.9272 4.1862 19.0613 3.7063 2.7528 1.1539 0.1449 0.5176 8.7043 5.7626 0.2215 4.1453 3.8353 5.4778 0.6103 175.4466 2.4217 0.1337 23.4800 27.5956 5.5455 9.9842 87.3077 88.4106 6.0174 14.5747 123.2128 12.5147 3.9166 11.3943 0.3329 0.0738 10.1011 11.2676 2.7181 0.3224 0.1219 1.0843 6.8749 22.4884 6.1414 3.6959 7.8433 1.4453 3.9449 35.2639 24.7938 12.6405 0.1603 56.0472 9.8647 100.7510 44.1560 10.0606 26.2616 15.1337 1.4235 60.6868 56.0593 10.5810 31.5822 12.5683 25.9467 58.3373 466.9586 8.8998 1.7142 31.6094 28.8832 3.7605 10.2563 0.0240 6.9394 27.8299 18.0247 26.8436 0.0318 0.0344 1.6930 94.1569
temp: 298.150 k
press: 1.00000 atm
elementType: 7 7 7 7 7 7 6 6 6 6 6 6 6 6 6 6 6 6 1 1 1 1 1 1 1 1 1 1 1 1
symmnumber: 1
zpe: 612140.1 jmol-1
zpe.correction: 0.233152 hartree
zpe.thermalcorrener: 0.248086 hartree
zpe.thermalcorrenthalpy: 0.249030 hartree
zpe.thermalcorrgfe: 0.188935 hartree
zpe.sumelectzpe: -791.695993 hartree
zpe.sumelectthermal: -791.681059 hartree
zpe.sumelectthermalent: -791.680115 hartree
zpe.sumelectthermalfe: -791.740210 hartree
dipole: -2.6066 0.5678 0.3498
dipole: 2.6906
quadrupole: -97.2974 -100.3081 -104.9726
quadrupole: -7.6406 3.6257 6.7583
quadrupole: 3.5619 0.5513 -4.1132 -7.6406 3.6257 6.7583
hfenergy: -791.9291446 hartree
pointgroup: C01 [X(C12H12N6)]
dipole: -1.0191022 0.2180756 0.1855197 debye
polarizability: 227.3477979|-20.3548949|163.343499|-6.0651598|4.5584466|111.2359596 unknown
InChI: InChI=1S/C12H12N6/c13-17-11-10-12(15-7-14-11)18(8-16-10)6-9-4-2-1-3-5-9/h1-5,7-8,17H,6,13H2
charge 0 multiplicity 1
30 atoms
N  -0.168264 0.876938 0.8241
N  1.47548 2.044838 -0.280612
N  0.942412 -1.342506 0.975087
N  3.185288 -1.320533 -0.040339
N  4.124318 0.61571 -1.04354
N  5.335022 -0.038603 -1.392985
C  -1.458893 0.556095 1.477086
C  0.878678 -0.025786 0.613011
C  1.883304 0.714606 -0.065674
C  -2.556309 0.167035 0.491874
C  0.242245 2.093768 0.261656
C  3.078731 0.004727 -0.390568
C  -2.499359 -1.084595 -0.174218
C  -3.641236 1.039954 0.235674
C  -3.511056 -1.449525 -1.088502
C  -4.656183 0.67424 -0.678608
C  2.130406 -1.908284 0.610325
C  -4.591635 -0.571292 -1.343562
H  -1.763636 1.433394 2.07428
H  -1.246795 -0.278815 2.168213
H  -0.393065 2.977082 0.277576
H  -1.661849 -1.762696 0.030611
H  -3.697156 2.006117 0.753984
H  -3.460752 -2.417796 -1.598904
H  -5.492532 1.355952 -0.869298
H  2.262563 -2.963651 0.866919
H  4.043289 1.598551 -1.305834
H  -5.37691 -0.856935 -2.052449
H  5.142135 -0.828592 -2.026043
H  5.81266 -0.378299 -0.545363
