program: Gaussian 09
title: 000235195
version: EM64L-G09RevD.01
frameworkgroup: C1[X(C15H16O4)]
method: RPBEPBE
basis: SDD
operation: Freq
keyword: #pfreq=noraman
keyword: PBEPBE/SDD
title: #p freq=noraman PBEPBE/SDD
converged: YES YES NO NO
title: Mulliken charges:
elementType: O O O O C C C C C C C C C C C C C C C H H H H H H H H H H H H H H H H
charge: -0.239994 -0.243821 -0.225209 -0.187202 -0.043975 -0.518208 0.107035 0.209948 -0.711864 -0.713965 0.218258 -0.523270 0.407232 0.191018 -0.524483 -0.267706 -0.313046 0.120387 -0.520742 0.238733 0.230916 0.229004 0.200146 0.219988 0.228882 0.204458 0.222577 0.212804 0.259539 0.294001 0.248789 0.255282 0.237192 0.283830 0.213464
chargesum: 0.00000
title: Mulliken charges with hydrogens summed into heavy atoms:
elementType: O O O O C C C C C C C C C C C C C C C
charge: -0.239994 -0.243821 -0.225209 -0.187202 0.194758 -0.058287 0.107035 0.209948 -0.062848 -0.074126 0.218258 -0.263731 0.407232 0.191018 -0.230482 -0.018917 -0.057763 0.120387 0.213744
polarizability: 3.07262621e+02 2.95830680e+01 1.89219330e+02 -8.42555403e+00 4.52877129e-01 9.63768463e+01
1716.lowfreq: -11.4116 -6.3460 -1.4910 -0.0007 0.0002 0.0005 25.9903 37.3615 51.8590
frequency: 25.7971 37.2420 51.8344 74.0007 80.1706 114.4849 136.7378 150.6053 179.8414 188.2441 207.9553 223.1793 236.8132 244.4143 256.5815 281.6637 315.5471 340.9262 359.7700 370.2693 404.0718 422.7434 439.9176 456.2323 466.7800 506.9867 554.7396 574.8513 604.5892 647.2826 686.2104 713.8188 717.6275 737.4974 749.8865 816.4652 821.7083 828.7943 836.2468 874.5512 882.8868 911.2335 916.6907 932.3032 955.3741 961.4185 984.2590 993.6067 1036.7346 1096.1260 1110.4763 1117.1983 1134.9238 1145.6443 1179.4872 1183.6772 1200.2216 1221.8018 1235.2762 1259.3997 1269.4166 1288.9747 1327.3357 1344.9886 1355.4250 1376.7411 1390.8355 1393.8126 1413.1080 1437.2136 1437.7613 1449.9601 1466.2891 1469.0562 1472.2197 1482.3323 1487.1085 1489.0531 1527.8845 1575.3435 1596.9202 1629.3195 1692.7309 2955.6544 2966.5850 2971.0352 2982.1360 3004.8055 3027.0072 3058.0225 3068.3141 3071.3651 3076.8556 3096.2951 3130.5784 3134.5135 3146.6054 3189.0921 3189.2937
redmass: 3.8510 2.9268 5.3416 4.5620 3.3412 4.7988 5.1018 4.7084 2.0969 1.8959 1.0860 3.9920 1.4880 3.1548 2.2492 7.0563 3.4900 3.0366 3.1667 5.4444 2.8714 3.2114 3.2287 3.1555 6.3317 7.6138 3.9279 4.4385 8.6309 3.9020 5.4878 6.9420 7.4760 5.9855 3.0384 5.3990 1.6317 2.9870 4.2034 1.6965 1.5826 1.6278 1.2121 3.2131 2.7142 1.6161 1.3266 2.3850 3.2343 1.6200 1.2834 2.5985 2.3053 1.4495 1.8713 1.7130 1.8695 1.3544 2.1604 2.0536 1.5238 2.0036 1.5772 1.4527 3.4194 1.2140 5.2726 1.2265 2.4655 1.2834 1.2018 1.0964 1.0518 1.0716 1.0577 1.0586 1.0738 3.0631 9.2370 7.6252 7.2426 7.4996 10.8930 1.0615 1.0359 1.0373 1.0327 1.0847 1.0958 1.0991 1.0984 1.0993 1.0988 1.0991 1.1057 1.0908 1.0905 1.0926 1.0954
irintensity: 1.2766 0.4720 2.7996 1.7582 2.0265 2.9631 4.6692 1.8990 3.2209 2.9947 0.1804 2.2384 0.0798 3.7029 5.1979 5.0060 5.9847 1.4662 1.3804 4.7215 4.3459 1.4036 1.5036 6.5716 0.1914 5.6710 18.1227 14.5111 11.8605 2.5066 23.5182 4.4018 45.2716 7.6006 5.9255 4.7462 30.6807 13.2722 39.6610 14.1124 48.3903 17.5187 11.4704 21.0166 4.7728 1.3276 0.3459 8.7097 86.3111 4.9499 12.4651 191.3009 42.8071 4.1801 26.6390 30.8687 265.8663 4.0852 22.0572 60.5751 9.2949 78.8641 16.1627 20.0412 69.6145 21.8278 16.5464 10.9818 9.6766 12.5489 34.9861 14.0625 1.9270 36.6109 18.5983 6.8922 27.6490 22.2739 53.9749 147.9915 136.4910 557.1535 470.1499 23.0511 39.4371 22.5367 56.6735 0.0450 11.0318 18.8748 56.9587 34.8112 80.1813 27.0362 15.3653 8.9040 4.9084 0.5821 1.6924
temp: 298.150 k
press: 1.00000 atm
elementType: 8 8 8 8 6 6 6 6 6 6 6 6 6 6 6 6 6 6 6 1 1 1 1 1 1 1 1 1 1 1 1 1 1 1 1
symmnumber: 1
zpe: 721574.3 jmol-1
zpe.correction: 0.274833 hartree
zpe.thermalcorrener: 0.293330 hartree
zpe.thermalcorrenthalpy: 0.294275 hartree
zpe.thermalcorrgfe: 0.227512 hartree
zpe.sumelectzpe: -880.684937 hartree
zpe.sumelectthermal: -880.666440 hartree
zpe.sumelectthermalent: -880.665496 hartree
zpe.sumelectthermalfe: -880.732258 hartree
dipole: 5.3665 -3.3509 1.8806
dipole: 6.6003
quadrupole: -143.1117 -100.3733 -115.4151
quadrupole: 6.3106 5.8290 5.0445
quadrupole: -23.4783 19.2601 4.2183 6.3106 5.8290 5.0445
hfenergy: -880.9597702 hartree
pointgroup: C01 [X(C15H16O4)]
dipole: 2.066889 1.327526 -0.8419553 debye
polarizability: 307.522513|-29.5086799|189.1775657|-3.7940317|3.1949346|96.1587186 unknown
InChI: InChI=1S/C15H16O4/c1-9(2)6-12(16)11-7-10-4-5-15(17)19-13(10)8-14(11)18-3/h4-5,7-9H,6H2,1-3H3
charge 0 multiplicity 1
35 atoms
O  -3.648941 -0.594815 0.091749
O  0.491916 -2.836374 -0.079642
O  2.702248 -1.010513 1.022458
O  -5.752682 0.359502 0.079892
C  4.271803 1.050393 -0.202738
C  2.736706 1.183593 -0.031948
C  2.05126 -0.129397 0.382437
C  0.590533 -0.304046 0.093467
C  4.623231 0.181924 -1.434151
C  4.919981 2.44951 -0.308946
C  -0.086661 -1.583706 0.034616
C  -0.219181 0.860198 0.060498
C  -1.631351 0.818183 0.057513
C  -2.259989 -0.468728 0.080786
C  -1.501857 -1.644554 0.059365
C  -2.478674 1.98921 0.049943
C  -3.851838 1.876068 0.057954
C  -4.52946 0.580673 0.077002
C  1.81825 -3.054401 -0.683512
H  4.660649 0.539922 0.699263
H  2.532012 1.932896 0.763109
H  2.284976 1.578274 -0.963007
H  4.233627 0.639417 -2.364769
H  5.718716 0.081829 -1.541595
H  4.202675 -0.835722 -1.341972
H  4.535499 3.001636 -1.188666
H  6.016683 2.366368 -0.419572
H  4.716683 3.059512 0.591454
H  0.263128 1.842999 0.088159
H  -1.992185 -2.619821 0.020073
H  -2.01192 2.981179 0.037244
H  -4.508047 2.749666 0.051269
H  1.772389 -4.080154 -1.079878
H  2.602717 -2.951325 0.081411
H  1.999005 -2.335296 -1.504768
