program: Gaussian 09
title: 000020587
version: EM64L-G09RevD.01
frameworkgroup: C1[X(C10H21NO2)]
method: RPBEPBE
basis: SDD
operation: Freq
keyword: #p
keyword: freq=noraman
keyword: PBEPBE/SDD
title: #p freq=noraman PBEPBE/SDD
converged: YES YES NO NO
title: Mulliken charges:
elementType: O O N C C C C C C C C C C H H H H H H H H H H H H H H H H H H H H H
charge: -0.447886 -0.436964 -0.122874 0.061463 -0.456946 -0.461609 -0.403205 -0.408981 -0.378951 -0.426782 -0.359625 -0.346524 -0.370064 0.159061 0.211444 0.201758 0.205172 0.212161 0.199605 0.188131 0.187857 0.199574 0.197028 0.191017 0.243695 0.254634 0.152367 0.245977 0.203131 0.197109 0.237100 0.199061 0.342846 0.330220
chargesum: 0.00000
title: Mulliken charges with hydrogens summed into heavy atoms:
elementType: O O N C C C C C C C C C C
charge: -0.105040 -0.106745 -0.122874 0.220524 -0.043744 -0.044276 -0.015469 -0.021550 0.009094 0.071547 0.038719 0.053717 0.066097
polarizability: 1.37896561e+02 -3.41514291e-01 1.23017000e+02 -9.30238227e-01 -2.08927155e+00 1.00881653e+02
1716.lowfreq: -18.8201 -8.2975 0.0003 0.0004 0.0006 2.7265 25.4380 41.2652 56.8017
frequency: 24.7975 41.2257 56.6637 89.7299 98.9837 120.1586 141.4481 192.4488 213.0897 261.5935 278.0371 284.0355 299.0527 312.9864 322.3273 382.4266 387.4419 431.0577 442.7434 480.3025 537.9379 586.8283 770.4489 786.4504 799.8384 817.5414 840.6386 858.3568 888.6927 897.3360 926.3704 954.5675 960.8771 978.6711 989.3436 1030.5476 1047.6208 1056.4260 1065.7736 1066.8520 1082.7461 1116.3529 1138.4918 1147.0848 1150.6652 1176.0793 1199.1060 1202.4578 1240.6768 1242.9388 1255.5910 1261.6247 1283.1281 1297.8781 1304.9301 1315.3074 1316.9496 1335.1804 1336.9435 1338.4327 1343.7913 1345.3168 1356.2239 1370.9619 1392.0531 1403.9238 1463.0981 1463.2802 1464.6878 1470.6112 1473.6106 1479.9607 1480.7194 1489.9855 1500.1448 2792.5769 2803.0425 2936.5497 2963.2194 2963.8689 2968.1460 2972.5573 2975.6171 2981.2517 2985.1023 3026.4516 3028.3936 3035.4479 3038.0617 3043.2077 3050.5044 3063.7224 3090.0086 3092.8900 3554.4560 3566.9047
redmass: 3.0490 3.9170 4.0313 2.4102 2.2007 3.4340 2.7621 2.8982 1.7885 1.1894 4.1144 2.0012 2.1453 2.2016 1.8617 2.5908 2.8014 3.0238 2.7808 1.6545 3.9577 2.6643 2.3039 1.4331 1.1442 1.2295 2.9051 1.9711 1.9603 1.3826 2.1707 3.9094 3.3384 2.5847 5.3171 2.8453 1.9281 1.3232 1.6961 1.8244 1.5097 2.3813 1.8919 2.2633 1.7281 1.3166 1.2228 1.6920 1.3985 1.4264 1.2802 1.2351 1.1805 1.2005 1.1730 1.3038 1.2646 1.3435 1.2672 1.4820 1.5014 1.4828 1.2463 1.4379 1.3382 1.3699 1.0842 1.0888 1.0890 1.0797 1.0809 1.0899 1.0726 1.0832 1.0769 1.0736 1.0768 1.0541 1.0633 1.0639 1.0625 1.0671 1.0611 1.0635 1.1049 1.0966 1.0948 1.0892 1.0763 1.0983 1.1000 1.0847 1.0999 1.0999 1.0661 1.0668
irintensity: 0.8613 2.9173 0.5253 8.2133 3.6193 3.2177 4.0438 6.8130 0.3872 75.9440 21.8192 72.1770 48.0929 49.5307 48.9478 6.4012 24.4598 0.1847 2.8120 0.3252 2.5661 5.4225 4.6996 0.4949 7.1951 3.8013 4.6066 28.2746 3.3619 10.1274 0.0592 125.5175 46.4019 30.1180 18.2771 37.8867 4.1675 1.5983 20.4430 1.0130 2.2341 0.0719 14.2299 14.7454 2.2389 3.2256 20.8839 6.5747 3.6755 2.1696 1.9151 5.8082 30.5370 2.5286 5.4607 0.7022 9.7712 0.4478 0.5793 16.8184 2.5123 0.2355 13.4065 16.2339 3.4412 1.4342 1.3746 5.8913 11.4454 20.2873 2.7624 2.1690 12.7209 9.4812 8.2053 52.9591 137.6276 58.8333 30.2357 46.6873 35.1494 41.8098 32.2881 16.2483 71.7306 71.8869 72.2885 3.9107 73.6627 23.9024 89.3553 33.2470 30.4224 29.4699 6.9855 1.5829
temp: 298.150 k
press: 1.00000 atm
elementType: 8 8 7 6 6 6 6 6 6 6 6 6 6 1 1 1 1 1 1 1 1 1 1 1 1 1 1 1 1 1 1 1 1 1
symmnumber: 1
zpe: 794886.1 jmol-1
zpe.correction: 0.302756 hartree
zpe.thermalcorrener: 0.317822 hartree
zpe.thermalcorrenthalpy: 0.318766 hartree
zpe.thermalcorrgfe: 0.259569 hartree
zpe.sumelectzpe: -597.725566 hartree
zpe.sumelectthermal: -597.710500 hartree
zpe.sumelectthermalent: -597.709556 hartree
zpe.sumelectthermalfe: -597.768753 hartree
dipole: 1.2697 1.4726 3.4150
dipole: 3.9298
quadrupole: -84.7378 -87.8187 -78.2864
quadrupole: -5.5332 -9.3618 2.2690
quadrupole: -1.1235 -4.2044 5.3279 -5.5332 -9.3618 2.2690
hfenergy: -598.0283224 hartree
pointgroup: C01 [X(C10H21N1O2)]
dipole: 0.5320041 -0.5909239 -1.3259683 debye
polarizability: 137.8197124|1.1071623|122.9572054|1.1301386|-2.6453792|101.0182953 unknown
InChI: InChI=1S/C10H21NO2/c12-8-6-11(7-9-13)10-4-2-1-3-5-10/h10,12-13H,1-9H2
charge 0 multiplicity 1
34 atoms
O  -2.166636 -3.285468 -0.140642
O  -3.617843 2.392217 -0.150937
N  -0.615229 0.11801 0.403866
C  0.770698 0.087266 -0.181173
C  1.419126 1.497338 -0.134262
C  1.673777 -0.925957 0.571052
C  2.879338 1.498309 -0.64647
C  3.133844 -0.917382 0.057022
C  3.757117 0.492484 0.127965
C  -1.237422 -1.21085 0.63309
C  -1.513583 1.091584 -0.269257
C  -1.540224 -2.047077 -0.632236
C  -2.912593 1.20744 0.370263
H  0.735684 -0.22579 -1.261506
H  1.384204 1.853524 0.915316
H  0.837453 2.214282 -0.741816
H  1.27581 -1.953106 0.472368
H  1.652386 -0.669729 1.649968
H  3.294741 2.521363 -0.564128
H  2.89244 1.236575 -1.725521
H  3.15641 -1.271782 -0.995025
H  3.732332 -1.638115 0.647276
H  4.786549 0.481469 -0.279761
H  3.830979 0.809151 1.188793
H  -2.182506 -1.075698 1.186594
H  -0.591785 -1.810627 1.294202
H  -1.634893 0.877858 -1.367945
H  -1.068049 2.096894 -0.191106
H  -0.602333 -2.267933 -1.185341
H  -2.22941 -1.49847 -1.310377
H  -2.817499 1.38864 1.453116
H  -3.527151 0.298323 0.209498
H  -2.377558 -3.879991 -0.903548
H  -3.755174 2.277545 -1.125738
