program: Gaussian 09
title: 000020582
version: EM64L-G09RevD.01
frameworkgroup: C1[X(C12H14N2)]
method: RPBEPBE
basis: SDD
operation: Freq
keyword: #pfreq=noraman
keyword: PBEPBE/SDD
title: #p freq=noraman PBEPBE/SDD
converged: YES YES NO NO
title: Mulliken charges:
elementType: N N C C C C C C C C C C C C H H H H H H H H H H H H H H
charge: -0.314320 -0.410393 -0.316174 -0.095923 0.486276 0.360632 -0.468480 -0.436927 0.246099 -0.436297 -0.713016 -0.472274 -0.390077 -0.227263 0.222637 0.183263 0.226600 0.201263 0.201140 0.261020 0.262721 0.224586 0.206974 0.231236 0.222072 0.300226 0.226794 0.217605
chargesum: 0.00000
title: Mulliken charges with hydrogens summed into heavy atoms:
elementType: N N C C C C C C C C C C C C
charge: -0.053300 -0.110167 -0.093537 -0.095923 0.486276 0.360632 -0.058617 -0.034523 0.246099 -0.173577 -0.050220 -0.250202 -0.163284 -0.009658
polarizability: 1.63027677e+02 -1.63418103e+00 1.72410804e+02 4.15833087e+00 5.83399972e+00 7.90184477e+01
1716.lowfreq: -9.0064 -0.0010 -0.0008 -0.0005 6.9101 11.5975 59.8916 119.0219 168.5078
frequency: 59.7951 119.0103 168.5072 218.1217 226.3182 255.3436 288.5443 304.2645 335.1049 343.6289 424.8060 467.4721 472.9104 494.5946 509.0333 541.7231 560.9443 586.7273 625.4124 632.3398 668.8628 699.9813 749.7914 786.0706 795.7626 804.8900 852.9502 879.3286 886.3509 919.7985 950.3683 980.3412 1006.4004 1035.0268 1048.3520 1071.9230 1082.6055 1095.8246 1128.3178 1155.4809 1192.2424 1199.0206 1230.4445 1236.0777 1258.9805 1275.1143 1292.2921 1334.7694 1345.5390 1353.2059 1374.9131 1376.5473 1386.0909 1416.2214 1439.3496 1448.4917 1457.0931 1461.0818 1466.2656 1485.7925 1502.4671 1563.9383 1587.6524 1624.7119 2928.9263 2961.9474 2974.5397 2979.0314 3015.6232 3027.1544 3072.3788 3085.4811 3110.7312 3129.1399 3154.2618 3216.0872 3478.9845 3615.0306
redmass: 3.2611 3.0011 2.3800 3.7928 1.2303 2.7725 2.7883 3.7057 3.0742 3.3632 2.7055 1.9671 3.2734 1.3080 3.2946 2.8184 2.5388 4.7172 3.0622 4.2255 2.7625 4.3408 1.4792 1.7246 2.5093 3.2796 3.0549 1.3853 2.2703 2.5120 1.3269 1.8437 2.9729 2.2178 2.7989 2.2526 2.0989 1.7718 1.6906 1.9623 1.7302 1.3378 1.3215 1.4885 1.7156 1.5270 1.7112 1.3707 1.9472 1.8025 1.2225 1.5151 4.0753 1.9701 2.1810 1.5215 1.0968 1.2085 1.0756 1.2280 2.3602 6.2440 7.0642 6.8536 1.0665 1.0593 1.0423 1.0776 1.0994 1.0956 1.0991 1.0995 1.0871 1.0895 1.0990 1.0981 1.0755 1.0808
irintensity: 0.4306 3.1893 3.1921 7.0352 0.2819 1.6541 18.2383 0.1779 3.4245 1.9763 26.1334 49.6503 21.4026 81.1221 8.0380 22.9596 18.5976 3.1418 2.0544 0.2325 11.5132 1.7430 78.4737 40.2404 2.2130 3.9046 1.9184 0.4307 1.8275 24.4716 1.6447 8.9039 11.5505 1.8429 13.6386 8.4517 6.9406 10.8197 21.8462 19.1107 31.0996 0.5218 1.0393 5.8890 5.2789 0.8225 10.7162 6.4296 28.5867 4.2312 16.7365 14.4357 27.1471 5.1673 3.2979 21.5490 12.2137 2.3056 9.2150 5.2184 1.1364 3.4309 5.4615 5.1770 59.8433 47.7606 39.7362 29.9168 41.9931 62.8327 46.5158 27.7782 13.7330 16.5963 33.8622 2.3538 1.1646 55.4741
temp: 298.150 k
press: 1.00000 atm
elementType: 7 7 6 6 6 6 6 6 6 6 6 6 6 6 1 1 1 1 1 1 1 1 1 1 1 1 1 1
symmnumber: 1
zpe: 617815.3 jmol-1
zpe.correction: 0.235313 hartree
zpe.thermalcorrener: 0.246777 hartree
zpe.thermalcorrenthalpy: 0.247721 hartree
zpe.thermalcorrgfe: 0.198699 hartree
zpe.sumelectzpe: -574.164637 hartree
zpe.sumelectthermal: -574.153174 hartree
zpe.sumelectthermalent: -574.152230 hartree
zpe.sumelectthermalfe: -574.201251 hartree
dipole: 0.1757 1.1321 0.9096
dipole: 1.4628
quadrupole: -65.6900 -73.7515 -89.4663
quadrupole: 5.4751 2.0412 2.4121
quadrupole: 10.6126 2.5511 -13.1637 5.4751 2.0412 2.4121
hfenergy: -574.3999505 hartree
pointgroup: C01 [X(C12H14N2)]
dipole: -0.0629928 0.4468483 -0.3571812 debye
polarizability: 163.1561481|1.7734305|172.3462221|3.373039|-5.8908162|78.9545588 unknown
InChI: InChI=1S/C12H14N2/c1-8-10-3-2-4-11-12(10)9(7-14-11)5-6-13-8/h2-4,7-8,13-14H,5-6H2,1H3
charge 0 multiplicity 1
28 atoms
N  2.530856 -0.086549 0.672488
N  -2.205423 1.612301 -0.25337
C  1.741669 -1.269567 0.254584
C  -0.403847 0.230403 0.064939
C  0.225248 -1.042292 0.230175
C  0.071715 1.608256 -0.015363
C  1.477586 2.125232 0.180574
C  2.569681 1.105681 -0.205761
C  -1.843089 0.274472 -0.077498
C  -1.051418 2.408594 -0.218434
C  2.204584 -1.88267 -1.111396
C  -0.60896 -2.182016 0.29343
C  -2.665475 -0.870998 -0.029095
C  -2.023965 -2.10749 0.171843
H  1.937663 -2.038172 1.029757
H  1.619294 3.059653 -0.400335
H  1.637402 2.375155 1.248753
H  2.471625 0.84662 -1.283629
H  3.55803 1.588321 -0.081434
H  3.467079 -0.37017 0.980823
H  -1.111469 3.490589 -0.325885
H  1.998075 -1.194666 -1.950612
H  3.290965 -2.092918 -1.08785
H  1.671052 -2.827036 -1.319414
H  -0.146706 -3.166731 0.440065
H  -3.154675 1.950288 -0.390708
H  -3.753947 -0.804685 -0.136044
H  -2.619049 -3.025504 0.232599
