program: Gaussian 09
title: 000235189
version: EM64L-G09RevD.01
frameworkgroup: C1[X(C10H13N3O3)]
method: RPBEPBE
basis: SDD
operation: Freq
keyword: #p
keyword: freq=noraman
keyword: PBEPBE/SDD
title: #p freq=noraman PBEPBE/SDD
converged: YES YES NO NO
title: Mulliken charges:
elementType: O O O N N N C C C C C C C C C C H H H H H H H H H H H H H
charge: -0.316297 -0.308801 -0.248150 0.050385 -0.390738 -0.648978 0.069745 0.328057 0.225366 -0.388523 -0.355339 -0.211122 -0.389489 -0.530287 -0.528048 0.302772 0.286742 0.251640 0.231158 0.240591 0.262542 0.224260 0.226992 0.249772 0.224230 0.229396 0.266075 0.300434 0.345617
chargesum: 0.00000
title: Mulliken charges with hydrogens summed into heavy atoms:
elementType: O O O N N N C C C C C C C C C C
charge: -0.316297 -0.308801 -0.248150 0.050385 -0.124663 -0.002927 0.069745 0.328057 0.225366 -0.101781 -0.103699 0.020036 -0.148898 0.183506 0.175350 0.302772
polarizability: 2.60464889e+02 1.00935735e+01 1.57970804e+02 -6.54094242e-01 -4.59907527e+00 7.22651657e+01
1716.lowfreq: -11.4747 -3.0615 -0.0003 0.0003 0.0009 4.1930 23.3322 40.2724 55.5331
frequency: 23.3087 40.2212 55.5254 80.0690 94.6113 103.2932 154.1822 159.0042 163.7325 168.3244 168.4418 209.4526 247.3318 262.3599 289.2538 341.7039 350.7315 372.6650 405.5705 455.4254 477.1537 487.3643 538.4588 547.1623 585.6555 589.3323 617.0181 655.3850 707.5276 728.9299 753.9021 781.7107 815.5320 892.2192 919.5852 943.9755 948.9925 953.2560 989.2162 994.2558 1042.7698 1063.0757 1113.4528 1114.4320 1128.3196 1146.5089 1153.5707 1164.0869 1180.1674 1232.7232 1275.6331 1287.0992 1322.8256 1373.5271 1412.1221 1429.2722 1441.1921 1456.4257 1459.4089 1460.3462 1478.4129 1488.5364 1509.9680 1569.5995 1588.5147 1596.0248 1605.3530 1683.0886 2970.2989 2973.9540 3012.8656 3066.3111 3073.4569 3119.8902 3120.7966 3141.2541 3160.7816 3173.1309 3361.9268 3538.8811 3696.3993
redmass: 4.6668 4.2728 4.6182 3.4519 4.3709 2.7600 3.4074 1.3555 2.0466 1.5979 1.6608 3.8260 5.6853 4.9491 3.2376 1.7021 4.8667 7.2044 4.8846 4.7838 4.0829 1.1275 5.2216 4.1959 1.3145 4.4434 4.3231 5.8698 8.5322 5.7881 2.2593 5.5271 1.9540 5.2752 1.3832 4.6155 4.3229 1.5113 1.3673 4.2753 2.5479 2.0158 1.2400 1.2391 4.3779 1.5022 1.3550 2.0884 1.4226 2.2743 1.7986 2.2111 2.3972 5.4044 1.6187 1.2941 1.7942 1.1359 1.3114 1.4682 1.0597 1.0525 1.9552 6.9342 6.0460 6.7590 1.2242 5.3990 1.0307 1.0309 1.0875 1.1044 1.1037 1.1025 1.1035 1.0866 1.0923 1.0993 1.0749 1.0459 1.1035
irintensity: 18.4569 1.3974 3.3388 10.9660 0.6475 8.5067 5.6164 0.3670 2.5903 4.9239 0.9797 4.7803 9.5331 5.4276 7.4447 104.5671 0.6948 0.7284 0.1265 6.1642 22.3752 220.3178 2.3720 1.3089 118.4619 7.1041 10.1578 5.2462 17.9944 11.4641 34.1501 10.5754 34.2003 12.7636 2.2969 52.4585 38.5644 25.5484 4.0148 113.8682 55.6390 30.9095 11.7297 2.9365 142.6259 17.1498 3.5890 23.9899 9.2262 126.0380 43.5108 602.7780 64.4050 27.2613 26.1443 9.5873 95.8256 31.7039 4.9010 26.6391 4.0975 21.5929 445.1603 10.1234 12.0448 11.9512 127.8423 288.5061 83.1676 59.1123 43.9849 28.3219 24.9591 27.2237 20.2331 7.1546 1.7153 13.2390 13.5869 63.6088 47.2190
temp: 298.150 k
press: 1.00000 atm
elementType: 8 8 8 7 7 7 6 6 6 6 6 6 6 6 6 6 1 1 1 1 1 1 1 1 1 1 1 1 1
symmnumber: 1
zpe: 587714.8 jmol-1
zpe.correction: 0.223849 hartree
zpe.thermalcorrener: 0.240770 hartree
zpe.thermalcorrenthalpy: 0.241714 hartree
zpe.thermalcorrgfe: 0.177995 hartree
zpe.sumelectzpe: -777.539998 hartree
zpe.sumelectthermal: -777.523077 hartree
zpe.sumelectthermalent: -777.522132 hartree
zpe.sumelectthermalfe: -777.585852 hartree
dipole: 0.7092 -5.9992 0.8001
dipole: 6.0937
quadrupole: -81.0927 -82.8862 -95.0159
quadrupole: 21.0499 0.5807 0.9040
quadrupole: 5.2389 3.4454 -8.6843 21.0499 0.5807 0.9040
hfenergy: -777.7638466 hartree
pointgroup: C01 [X(C10H13N3O3)]
dipole: 0.2902851 2.3451613 -0.4046353 debye
polarizability: 260.3433154|-10.7431302|157.6353886|-0.4037957|-7.7032896|72.7221544 unknown
InChI: InChI=1S/C10H13N3O3/c1-15-8-5-3-4-7(9(8)16-2)6-12-13-10(11)14/h3-6,13H,11H2,1-2H3
charge 0 multiplicity 1
29 atoms
O  1.615928 1.695926 -0.150543
O  4.05033 0.130824 0.033283
O  -4.744356 -1.093616 0.130057
N  -2.098421 -0.12589 -0.004372
N  -3.202641 0.686381 -0.130325
N  -5.506313 1.080789 -0.240928
C  1.577624 0.288272 0.012559
C  0.30718 -0.357149 0.051055
C  2.772876 -0.481411 0.084572
C  0.258712 -1.772598 0.206656
C  2.704796 -1.878177 0.259848
C  1.443997 -2.519761 0.327698
C  -0.913455 0.44908 -0.063727
C  2.240752 2.434034 0.97461
C  4.375636 0.757512 -1.269321
C  -4.50368 0.123004 -0.065571
H  -0.724509 -2.251863 0.238258
H  3.642036 -2.439224 0.330113
H  1.394876 -3.605576 0.460387
H  -0.772595 1.536568 -0.208559
H  3.278795 2.094222 1.13534
H  1.650177 2.287825 1.898791
H  2.219944 3.493531 0.6765
H  3.635281 1.535641 -1.529745
H  4.406567 -0.011941 -2.063896
H  5.374065 1.202409 -1.13952
H  -3.089628 1.702803 -0.268245
H  -5.337176 2.065729 -0.434414
H  -6.464894 0.744553 -0.199664
