program: Gaussian 09
title: 000020601
version: EM64L-G09RevD.01
frameworkgroup: C1[X(C15H11N3O)]
method: RPBEPBE
basis: SDD
operation: Freq
keyword: #p
keyword: freq=noraman
keyword: PBEPBE/SDD
title: #p freq=noraman PBEPBE/SDD
converged: YES YES NO NO
title: Mulliken charges:
elementType: O N N N C C C C C C C C C C C C C C C H H H H H H H H H H H
charge: -0.215514 -0.058383 0.011932 -0.405614 0.012421 -0.012480 0.326095 0.336417 -0.357688 -0.357204 -0.371282 -0.380062 -0.228899 -0.234490 -0.222788 -0.231360 -0.233520 -0.240418 0.051319 0.261240 0.278206 0.256741 0.258591 0.233645 0.234547 0.232586 0.231347 0.234251 0.233397 0.356968
chargesum: 0.00000
title: Mulliken charges with hydrogens summed into heavy atoms:
elementType: O N N N C C C C C C C C C C C C C C C
charge: -0.215514 -0.058383 0.011932 -0.048646 0.012421 -0.012480 0.326095 0.336417 -0.096448 -0.078998 -0.114540 -0.121471 0.004746 0.000057 0.009798 -0.000013 0.000731 -0.007021 0.051319
polarizability: 2.41363721e+02 2.10828278e+01 2.32424256e+02 -1.99540520e+01 1.59097867e+01 1.09278600e+02
1716.lowfreq: -6.0544 -2.5439 -0.0002 0.0001 0.0006 6.2759 47.2295 50.3165 54.0816
frequency: 47.2279 50.3095 54.0767 80.1473 97.8045 131.0313 168.4401 225.3232 247.7154 272.1322 334.9052 350.0222 401.5496 403.4669 406.7506 432.6197 490.6269 504.7740 561.1772 601.8820 608.1079 616.8903 619.0458 672.2720 684.7760 698.7509 701.3076 728.0629 750.2876 759.5404 774.5110 795.3654 852.5101 855.1947 872.9253 926.1763 937.3005 974.1371 979.8025 984.5328 989.0090 989.3610 998.3359 1002.2405 1005.7821 1030.4627 1038.8030 1081.2724 1085.8887 1109.1516 1160.3117 1174.8975 1175.6656 1192.9901 1195.3760 1291.8070 1313.3989 1321.4844 1347.5321 1358.3049 1377.7078 1383.9210 1431.9632 1432.9903 1450.2260 1482.6807 1487.3780 1510.1411 1583.2364 1585.4445 1607.4653 1611.4087 1648.5001 3129.5496 3131.1471 3138.4313 3142.8366 3150.9955 3155.6676 3159.6888 3165.9564 3170.6382 3173.8495 3521.6846
redmass: 5.9724 4.0017 5.0473 5.0337 4.9695 5.6463 6.6714 5.4117 6.3086 5.6460 5.9989 6.3377 2.9617 7.2467 2.9262 7.1634 3.9359 4.9174 5.1343 7.3611 7.5641 6.7522 7.0047 3.4416 6.3621 1.8336 1.7462 4.4409 4.0242 1.5695 1.8713 3.1071 1.2489 1.2618 6.8723 1.4037 1.4152 4.2295 1.5218 1.5387 5.5128 5.8189 1.3226 1.4182 4.8805 2.0948 2.2979 1.8850 1.7000 3.4531 4.5930 1.0555 1.0559 1.1158 1.1271 4.5959 1.6306 1.3616 2.4643 3.8936 7.5617 8.4615 2.0791 2.1615 2.3845 2.2946 2.5436 7.6229 5.9405 6.0910 5.9376 5.9993 7.3110 1.0849 1.0854 1.0882 1.0889 1.0927 1.0933 1.0963 1.0957 1.1013 1.1005 1.0794
irintensity: 2.3075 0.1272 1.0520 0.3298 2.1942 0.9786 1.4297 0.8415 0.5134 0.4218 1.0986 2.2368 0.8455 4.7359 1.2690 1.4760 1.7334 11.8089 10.9884 9.1478 0.3703 1.4861 0.6397 6.4704 5.3337 28.7953 85.6886 7.0473 47.7298 101.5626 29.5046 23.9657 0.6915 2.8213 19.3306 2.5088 3.6590 23.3236 2.5161 8.6905 0.0896 4.8671 0.1480 3.3768 50.4946 2.0890 9.4411 33.3281 10.6575 30.0404 34.0228 0.2116 0.1141 7.4880 2.3874 35.4656 23.9768 3.4883 75.2540 57.9591 0.1987 6.9560 5.6826 28.9762 8.0664 5.3175 17.9228 156.7687 0.0488 6.4449 45.2952 4.0529 639.8716 0.8403 0.0818 4.1207 7.6262 22.1261 20.3843 21.1817 13.9285 15.5032 15.5555 74.4475
temp: 298.150 k
press: 1.00000 atm
elementType: 8 7 7 7 6 6 6 6 6 6 6 6 6 6 6 6 6 6 6 1 1 1 1 1 1 1 1 1 1 1
symmnumber: 1
zpe: 593043.1 jmol-1
zpe.correction: 0.225878 hartree
zpe.thermalcorrener: 0.240526 hartree
zpe.thermalcorrenthalpy: 0.241470 hartree
zpe.thermalcorrgfe: 0.183056 hartree
zpe.sumelectzpe: -816.358012 hartree
zpe.sumelectthermal: -816.343364 hartree
zpe.sumelectthermalent: -816.342420 hartree
zpe.sumelectthermalfe: -816.400834 hartree
dipole: 5.1903 2.5076 -0.9408
dipole: 5.8406
quadrupole: -120.8932 -97.1409 -106.5130
quadrupole: -8.9383 -0.1365 6.8892
quadrupole: -12.7108 11.0414 1.6694 -8.9383 -0.1365 6.8892
hfenergy: -816.5838901 hartree
pointgroup: C01 [X(C15H11N3O1)]
dipole: -2.2014508 0.0380732 -0.6574924 debye
polarizability: 252.8838099|14.3122103|205.4168691|24.788775|-39.1110536|124.7658974 unknown
InChI: InChI=1S/C15H11N3O/c19-15-16-13(11-7-3-1-4-8-11)14(17-18-15)12-9-5-2-6-10-12/h1-10,18H
charge 0 multiplicity 1
30 atoms
O  4.447994 0.68085 0.882508
N  2.365793 -0.418526 0.581824
N  1.415987 2.0136 -0.51408
N  2.737385 1.759462 -0.291013
C  1.071535 -0.271463 0.253583
C  0.543606 1.038177 -0.179804
C  0.25495 -1.51795 0.265622
C  -0.892994 1.41778 -0.251726
C  -0.801503 -1.739038 -0.660566
C  0.606377 -2.552513 1.175797
C  -1.818564 0.963237 0.726525
C  -1.342467 2.307366 -1.264481
C  -1.496489 -2.966324 -0.664473
C  -0.102949 -3.769911 1.181211
C  -3.166019 1.378603 0.680579
C  -2.691155 2.716674 -1.310359
C  -1.158089 -3.980984 0.261322
C  -3.609813 2.252011 -0.339406
C  3.266883 0.652653 0.455093
H  -1.06875 -0.966734 -1.38771
H  1.444956 -2.382396 1.857949
H  -1.485639 0.295097 1.527238
H  -0.624668 2.672472 -2.005961
H  -2.29992 -3.131302 -1.390367
H  0.168802 -4.555219 1.894669
H  -3.86739 1.024432 1.443775
H  -3.025828 3.396623 -2.101426
H  -1.707141 -4.929208 0.262058
H  -4.65767 2.569712 -0.375271
H  3.377981 2.512216 -0.558507
