program: Gaussian 09
title: 000235193
version: EM64L-G09RevD.01
frameworkgroup: C1[X(C21H29NO2)]
method: RPBEPBE
basis: SDD
operation: Freq
keyword: #p
keyword: freq=noraman
keyword: PBEPBE/SDD
title: #p freq=noraman PBEPBE/SDD
converged: YES YES NO NO
title: Mulliken charges:
elementType: O O N C C C C C C C C C C C C C C C C C C C C C H H H H H H H H H H H H H H H H H H H H H H H H H H H H H
charge: -0.312837 -0.266372 -0.468605 -0.381080 -0.382894 -0.383557 -0.371694 -0.375391 -0.354019 -0.397339 -0.356222 -0.267234 -0.696515 0.158039 0.341140 0.247427 0.433330 -0.387152 -0.338928 -0.470664 -0.425214 -0.233091 -0.273582 -0.243752 0.193865 0.193725 0.192750 0.192636 0.195981 0.195838 0.189856 0.189706 0.195550 0.195560 0.187839 0.187925 0.212475 0.212531 0.194999 0.194918 0.226784 0.227294 0.215454 0.209714 0.209683 0.332731 0.301530 0.193040 0.238231 0.239271 0.227467 0.228639 0.230211
chargesum: 0.00000
title: Mulliken charges with hydrogens summed into heavy atoms:
elementType: O O N C C C C C C C C C C C C C C C C C C C C C
charge: -0.312837 -0.266372 -0.135874 0.006511 0.002491 0.008261 0.007868 0.015720 0.021745 0.027668 0.033695 0.186844 -0.061664 0.158039 0.341140 0.247427 0.433330 -0.085622 -0.145888 -0.232433 -0.185944 -0.005623 -0.044942 -0.013541
polarizability: 3.63047742e+02 -1.54527948e+01 2.65050180e+02 3.17281385e-01 2.09802663e-01 1.39077608e+02
1716.lowfreq: -0.0016 -0.0011 0.0017 3.2043 4.4696 9.9888 16.4048 18.6966 23.2070
frequency: 15.3318 18.5397 23.0968 31.9513 45.2144 51.9072 55.3116 66.1065 78.5462 102.2605 104.0830 116.3489 124.5851 129.8988 147.8346 151.2734 163.7503 174.1252 178.1564 231.3071 233.5758 249.3136 274.0990 298.1230 319.6019 400.3265 406.3343 418.6130 424.7399 472.3553 478.9718 488.8146 510.7928 519.7808 557.1627 617.7926 624.3687 646.5855 687.3544 701.8921 719.7181 723.4214 734.7871 740.0196 758.0228 762.2219 782.7584 783.6956 790.1685 808.3468 844.0522 861.1319 869.8755 888.6339 905.9106 911.4285 924.2253 952.1552 969.0288 973.0610 985.7514 991.3245 992.6597 1002.1878 1022.6641 1031.5991 1036.1427 1055.7136 1061.2933 1069.8642 1080.9171 1081.6945 1094.0875 1096.0124 1126.4247 1152.0162 1155.1850 1161.8864 1182.8325 1184.2974 1196.1058 1210.9182 1211.7463 1236.2549 1241.8700 1246.4783 1266.3376 1272.5894 1276.4882 1278.9362 1283.1191 1289.5785 1289.6948 1297.2755 1298.5941 1309.4957 1336.9707 1353.0431 1356.5100 1359.5450 1364.6005 1379.1345 1391.4893 1409.7276 1420.7102 1444.2602 1455.1303 1460.1277 1460.5579 1464.2293 1465.6840 1468.6831 1473.3230 1478.3953 1478.5186 1483.3820 1487.5519 1489.1062 1496.2293 1540.9087 1592.0353 1599.2381 1635.6322 1664.6435 2949.5098 2949.9995 2952.4261 2954.3266 2958.3966 2964.1888 2968.1105 2972.2540 2982.6650 2987.5194 2988.5852 2994.5230 2999.7520 3003.9502 3016.8041 3029.2728 3039.1647 3045.4935 3068.6485 3070.5209 3073.8358 3111.2940 3125.5058 3129.9864 3143.1667 3154.1146 3163.6292 3188.1113 3565.1803
redmass: 4.6282 3.1330 2.1406 3.7472 4.3976 4.3870 2.6896 2.3623 2.7444 3.7253 1.9862 2.6412 5.1968 2.4273 2.2982 2.0587 4.3129 3.5333 4.0765 4.1750 1.1257 5.7259 3.8868 5.5810 3.8664 4.6127 3.3454 2.9546 4.1593 3.3748 3.8101 3.0133 6.8453 6.2004 2.3430 6.4396 1.5517 3.3766 7.0595 6.6118 1.0596 1.0726 1.0932 1.2933 1.1214 6.7622 2.0598 5.4984 1.1643 1.4263 1.2094 4.7602 1.8523 1.9028 1.2146 8.2410 1.3542 1.4024 1.1764 7.2404 1.3319 5.2668 1.3572 4.0002 1.0878 3.2873 3.0995 3.0340 2.7012 2.8371 2.0824 2.2416 2.5889 2.2698 3.1134 1.6350 1.4879 1.9964 1.1183 1.7337 1.2859 1.2834 1.4547 1.8973 1.3247 1.2998 1.2003 1.6206 1.0995 1.3165 1.0601 2.3764 1.0848 1.1189 1.1046 1.3363 1.4066 1.5494 1.6678 1.6273 1.9439 1.6638 1.2185 2.9057 5.5192 2.4791 2.3205 1.0753 1.0737 1.0695 1.0731 1.0835 1.0882 1.0421 1.0938 1.1061 1.1273 1.1612 2.0233 2.8071 7.3747 5.2892 6.3000 7.6468 1.0589 1.0588 1.0593 1.0592 1.0592 1.0588 1.0585 1.0367 1.0965 1.0980 1.0596 1.1001 1.0566 1.1024 1.1041 1.1046 1.1044 1.1047 1.1007 1.0993 1.1081 1.0863 1.0874 1.0868 1.0939 1.0966 1.1004 1.0945 1.0749
irintensity: 0.0823 0.0514 0.0209 0.2893 2.4105 0.2257 0.9024 0.5956 0.0123 0.5693 0.8717 0.0661 0.1689 0.4980 0.2476 0.0026 2.0229 3.5434 2.5880 2.5355 0.0028 1.2645 5.5901 7.9885 8.5792 2.8914 2.6675 10.8063 6.0405 0.1254 0.0535 2.8135 0.0562 0.3154 0.0122 7.4845 37.9939 5.3691 8.8295 37.1820 17.3454 0.0145 5.3413 24.1943 0.0020 6.2412 69.6611 5.7577 1.5172 75.8337 0.4055 11.9417 17.0161 5.4417 0.2681 6.8100 2.8459 1.8279 0.5444 120.6072 0.9326 50.9363 4.6980 0.5536 0.0271 5.6304 57.0135 9.1788 100.8571 47.4105 1.0222 0.2706 104.9258 4.5404 1.2640 185.8723 0.9664 303.7694 9.1672 0.0101 2.7507 17.9477 0.1929 3.9822 0.0007 1.7420 0.3252 19.8527 0.0303 4.5173 0.4323 17.6366 0.2420 0.0151 0.0897 0.0653 2.0384 2.4180 2.8339 5.3405 87.7788 4.6521 11.2656 34.4233 91.2602 4.2283 0.7681 0.0064 0.0150 0.0290 0.2623 5.8589 3.9697 12.3554 23.2654 17.3748 56.2795 60.3851 283.1048 420.8995 50.0267 10.0714 9.4671 238.1020 0.0512 0.1489 0.1312 1.9214 1.7051 50.9766 187.6937 37.3587 0.0226 0.1339 18.1882 0.3175 48.7620 0.3159 3.1301 0.0066 104.8713 93.8012 93.5047 55.1912 85.8186 18.5055 0.8497 2.0693 32.3876 33.4654 28.3596 4.9452 27.4856
temp: 298.150 k
press: 1.00000 atm
elementType: 8 8 7 6 6 6 6 6 6 6 6 6 6 6 6 6 6 6 6 6 6 6 6 6 1 1 1 1 1 1 1 1 1 1 1 1 1 1 1 1 1 1 1 1 1 1 1 1 1 1 1 1 1
symmnumber: 1
zpe: 1192516.7 jmol-1
zpe.correction: 0.454206 hartree
zpe.thermalcorrener: 0.479669 hartree
zpe.thermalcorrenthalpy: 0.480613 hartree
zpe.thermalcorrgfe: 0.393930 hartree
zpe.sumelectzpe: -1021.053590 hartree
zpe.sumelectthermal: -1021.028127 hartree
zpe.sumelectthermalent: -1021.027182 hartree
zpe.sumelectthermalfe: -1021.113866 hartree
dipole: 1.1736 2.2311 0.0006
dipole: 2.5210
quadrupole: -131.0969 -143.8627 -149.6845
quadrupole: -8.6745 0.0675 0.0983
quadrupole: 10.4512 -2.3147 -8.1365 -8.6745 0.0675 0.0983
hfenergy: -1021.5077959 hartree
pointgroup: C01 [X(C21H29N1O2)]
dipole: 0.4534876 0.8820327 -0.0084942 debye
polarizability: 363.3292069|-14.5316423|264.7635653|-0.0191749|-0.8658906|139.082758 unknown
InChI: InChI=1S/C21H29NO2/c1-2-3-4-5-6-7-8-11-17-24-21(23)22-20-16-12-14-18-13-9-10-15-19(18)20/h9-10,12-16,22H,2-8,11,17H2,1H3
charge 0 multiplicity 1
53 atoms
O  -0.513788 -0.302447 0.01539
O  -1.672768 -2.353234 0.03555
N  -2.768871 -0.241412 0.014859
C  5.844474 -0.437811 0.002492
C  7.033329 0.548887 -0.024023
C  4.465409 0.259054 -0.012974
C  8.409034 -0.155256 -0.00741
C  3.285527 -0.738219 0.014363
C  9.603153 0.825203 -0.031903
C  1.904065 -0.042002 0.001514
C  10.976702 0.115896 -0.014436
C  0.766931 -1.062904 0.025709
C  12.165676 1.100646 -0.037837
C  -5.114224 0.4982 0.010609
C  -4.146818 -0.583916 0.016921
C  -1.677526 -1.097376 0.023042
C  -6.524583 0.158647 0.011321
C  -4.576695 -1.920834 0.024464
C  -4.754036 1.88813 0.003876
C  -6.929547 -1.216014 0.018722
C  -7.497792 1.212662 0.00482
C  -5.968731 -2.226614 0.025355
C  -5.725903 2.892542 -0.002244
C  -7.114188 2.553958 -0.00192
H  5.918218 -1.122506 -0.868378
H  5.920885 -1.077539 0.906712
H  6.959984 1.188449 -0.928578
H  6.961896 1.233829 0.846826
H  4.386381 0.897367 -0.917573
H  4.389464 0.942629 0.8582
H  8.479936 -0.839933 -0.87864
H  8.480779 -0.796149 0.896477
H  3.370033 -1.377238 0.918035
H  3.365117 -1.420312 -0.857707
H  9.535141 1.510155 0.83934
H  9.534894 1.466211 -0.935962
H  1.808646 0.589902 -0.902496
H  1.812068 0.629003 0.877261
H  11.043708 -0.568057 -0.885228
H  11.043315 -0.524902 0.888634
H  0.793875 -1.693702 0.933898
H  0.787673 -1.729277 -0.856768
H  13.134695 0.568495 -0.023924
H  12.139738 1.731786 -0.946341
H  12.138181 1.775647 0.838517
H  -2.518199 0.747492 0.005709
H  -3.835051 -2.721686 0.029651
H  -3.70328 2.202987 0.003906
H  -7.998721 -1.455865 0.019208
H  -8.559876 0.940059 0.00538
H  -6.274477 -3.278394 0.031226
H  -5.422468 3.944993 -0.007162
H  -7.868685 3.347769 -0.00678
