program: Gaussian 09
title: 000235151
version: EM64L-G09RevD.01
frameworkgroup: C1[X(C6H12N2O4)]
method: RPBEPBE
basis: SDD
operation: Freq
keyword: #p
keyword: freq=noraman
keyword: PBEPBE/SDD
title: #p freq=noraman PBEPBE/SDD
converged: YES YES YES YES
title: Mulliken charges:
elementType: O O O O N N C C C C C C H H H H H H H H H H H H
charge: -0.305231 -0.305226 -0.293775 -0.293782 -0.364404 -0.364428 -0.382261 -0.382212 0.296954 0.296959 -0.495897 -0.495899 0.259542 0.245931 0.245922 0.259499 0.330679 0.330678 0.240699 0.237928 0.229846 0.240713 0.237918 0.229848
chargesum: 0.00000
title: Mulliken charges with hydrogens summed into heavy atoms:
elementType: O O O O N N C C C C C C
charge: -0.305231 -0.305226 -0.293775 -0.293782 -0.033726 -0.033749 0.123212 0.123209 0.296954 0.296959 0.212575 0.212579
polarizability: 1.17703606e+02 -4.44688804e-03 8.73639945e+01 1.14275259e+01 4.84425440e-04 7.23663974e+01
1716.lowfreq: -0.0002 0.0009 0.0010 3.5096 5.4516 8.6142 24.7382 37.2496 46.2549
frequency: 24.7382 37.1473 46.2526 63.2028 65.1638 82.9902 94.2345 132.7887 159.5138 203.4087 228.6017 259.2882 305.7395 332.0745 430.1787 473.3074 497.6397 550.1772 570.3681 636.5459 652.5420 706.1069 707.3595 828.4639 842.7893 878.3614 901.5946 996.1434 1002.6575 1104.2089 1118.3600 1119.0025 1124.3378 1135.0416 1148.5889 1151.7183 1199.6950 1225.5319 1259.9135 1301.0641 1349.9510 1370.9956 1423.2485 1424.0543 1451.1727 1451.4894 1452.7257 1455.2902 1469.5680 1469.9011 1490.7598 1491.5829 1665.3365 1665.4584 2999.8933 3000.0533 3010.7650 3020.1695 3083.5030 3099.0007 3099.0201 3100.1990 3142.2448 3142.2804 3585.6269 3585.8666
redmass: 4.7310 3.1371 2.2530 1.2367 1.6937 4.6143 4.2325 3.3531 4.0524 2.9425 2.9445 4.8961 4.2586 3.3080 3.2971 3.3414 1.1500 2.8500 1.1590 4.8827 5.7799 12.1028 8.8398 2.7969 4.0559 3.4935 3.4996 4.7698 4.0972 2.2096 1.3625 1.2545 3.8637 5.6468 1.4209 1.4610 1.8932 2.2592 1.3275 1.1348 1.2748 1.2697 1.1570 1.1580 1.0692 1.0508 1.1296 1.1990 1.0603 1.0572 1.7222 1.6938 8.3671 8.2540 1.0299 1.0299 1.0619 1.0624 1.1031 1.1046 1.1046 1.1024 1.1041 1.1041 1.0782 1.0780
irintensity: 0.6759 4.1794 0.6510 2.8467 1.8615 14.9312 0.9088 3.2670 10.8772 3.6557 2.9903 19.0868 37.7319 5.7512 0.7714 0.9952 224.0420 9.8171 41.4918 4.4369 5.8916 10.2004 34.2247 17.0369 32.4355 2.1521 1.0213 22.5913 145.0709 0.6070 14.6827 0.0014 102.7111 60.8624 77.7758 10.9927 192.1200 156.9925 93.3910 16.6134 12.8191 18.7601 6.6474 4.6973 16.9202 7.0337 122.0299 1.0315 30.8351 46.9733 139.8251 372.3818 397.9831 114.4872 79.6645 9.1440 12.0954 36.8818 6.6606 40.1800 24.2731 11.7606 9.3398 28.3667 54.1802 22.4517
temp: 298.150 k
press: 1.00000 atm
elementType: 8 8 8 8 7 7 6 6 6 6 6 6 1 1 1 1 1 1 1 1 1 1 1 1
symmnumber: 1
zpe: 503011.8 jmol-1
zpe.correction: 0.191587 hartree
zpe.thermalcorrener: 0.206009 hartree
zpe.thermalcorrenthalpy: 0.206953 hartree
zpe.thermalcorrgfe: 0.147268 hartree
zpe.sumelectzpe: -645.295014 hartree
zpe.sumelectthermal: -645.280592 hartree
zpe.sumelectthermalent: -645.279648 hartree
zpe.sumelectthermalfe: -645.339333 hartree
dipole: -0.0010 2.6221 0.0013
dipole: 2.6221
quadrupole: -65.5789 -70.9846 -70.2552
quadrupole: 0.0027 -2.6877 -0.0016
quadrupole: 3.3607 -2.0451 -1.3156 0.0027 -2.6877 -0.0016
hfenergy: -645.486601 hartree
pointgroup: C01 [X(C6H12N2O4)]
dipole: 0.0002104 1.0315942 -0.0021669 debye
dipolederiv: -1.1157408 0.4654801 -0.1003196 0.8068098 -0.9812607 -0.0190081 0.0204123 -0.1268128 -0.4056371 -1.11545 -0.465978 -0.0988279 -0.8067098 -0.9809829 0.0208859 0.0232105 0.1288261 -0.4062209 -0.7415128 -0.0296377 -0.1828139 -0.0248948 -0.7252468 -0.2609576 -0.2035544 -0.2680499 -0.6355596 -0.7413947 0.0288344 -0.1829908 0.023985 -0.7232433 0.261253 -0.203641 0.2683327 -0.6376664 -1.2857731 0.2350975 -0.1404711 0.1750756 -0.4565716 0.054393 -0.2708011 0.1424483 -0.60786 -1.2854891 -0.2358179 -0.1398211 -0.1761374 -0.4574725 -0.0550184 -0.2702606 -0.1431615 -0.6072019 0.4490233 -0.1806727 -0.0663304 -0.380814 0.3827427 -0.0556471 -0.0910671 0.0642262 0.1615013 0.4489627 0.1804754 -0.0668685 0.3803855 0.3830048 0.054915 -0.0922709 -0.0649946 0.1614516 1.8488997 -0.4336469 0.4839131 -0.6540183 1.296986 0.3097459 0.4898489 0.377815 0.8160807 1.8482573 0.4357571 0.4826107 0.6561166 1.2946317 -0.311229 0.487681 -0.3793192 0.8189654 0.6816843 -0.2033353 0.0752897 -0.1225903 0.3074999 -0.0548058 0.1670352 -0.1165596 0.3005995 0.6814859 0.2037113 0.0746739 0.1232727 0.3082019 0.0548482 0.1666862 0.1166349 0.3000856 0.0341339 0.0566031 -0.0887908 0.0373512 0.0807697 -0.0456045 -0.0740485 -0.0202295 -0.0204314 -0.0369106 -0.1104743 0.0390066 -0.0050555 -0.0865296 0.0297686 0.0721715 -0.0150187 0.0970867 -0.0370091 0.110612 0.0386279 0.0053043 -0.0866457 -0.029172 0.0721703 0.0156489 0.097114 0.0340961 -0.0568841 -0.0886211 -0.0375751 0.0809461 0.0452445 -0.0739549 0.0198534 -0.0206884 0.2049585 0.0413452 -0.0671303 0.08751 0.1699054 -0.0567407 -0.0738046 -0.056993 0.2816864 0.2050262 -0.0416415 -0.0669905 -0.0878308 0.1703303 0.0571112 -0.0735119 0.0573928 0.2811792 -0.0841526 -0.0272628 0.0083249 -0.1412435 -0.0117949 0.0532439 -0.0108486 0.0738151 0.0631267 0.0018071 0.0322366 0.0411055 -0.0068279 0.1011762 -0.002412 -0.0472784 0.0676856 -0.1349843 0.043687 0.0670543 -0.0016298 0.1135944 -0.0778156 -0.0584234 0.0220637 -0.0808805 0.0845322 -0.084074 0.0273163 0.0081303 0.1412247 -0.0122833 -0.0528566 -0.0115107 -0.0734846 0.0636509 0.001785 -0.0320619 0.0412976 0.0066087 0.1008834 0.0014238 -0.0472371 -0.0686932 -0.1347538 0.0436997 -0.0671103 -0.0013745 -0.1135412 -0.0772313 0.0590422 0.02251 0.0815181 0.0839437 unknown
polarizability: 117.6061146|0.028143|87.3639626|11.6188648|-0.0225979|72.4639206 unknown
InChI: InChI=1S/C6H12N2O4/c1-11-5(9)7-3-4-8-6(10)12-2/h7-8H,3-4H2,1-2H3
charge 0 multiplicity 1
24 atoms
O  -3.115974 1.147967 0.478274
O  3.115548 1.147158 -0.481958
O  -2.888599 -0.887187 -0.700347
O  2.88818 -0.883603 0.704208
N  -1.27452 -0.14272 0.834099
N  1.274447 -0.145238 -0.833538
C  -0.384503 -1.300401 0.67443
C  0.38471 -1.302598 -0.669931
C  -2.451507 -0.046969 0.131505
C  2.451187 -0.046592 -0.13093
C  -4.408378 1.353899 -0.206075
C  4.407632 1.355924 0.202139
H  0.338826 -1.303731 1.506786
H  -0.9820 -2.229278 0.726855
H  0.982396 -2.231532 -0.719216
H  -0.338605 -1.308899 -1.502284
H  -1.028198 0.620733 1.46304
H  1.02823 0.615729 -1.465526
H  -5.113587 0.543946 0.046672
H  -4.268994 1.380684 -1.300325
H  -4.771763 2.321829 0.167842
H  5.112942 0.544906 -0.046873
H  4.267717 1.387295 1.296199
H  4.771212 2.322278 -0.175644
