program: Gaussian 09
title: 000235142
version: EM64L-G09RevD.01
frameworkgroup: C1[X(C12H24N2O5)]
method: RPBEPBE
basis: SDD
operation: Freq
keyword: #p
keyword: freq=noraman
keyword: PBEPBE/SDD
title: #p freq=noraman PBEPBE/SDD
converged: YES YES NO NO
title: Mulliken charges:
elementType: O O O O O N N C C C C C C C C C C C C H H H H H H H H H H H H H H H H H H H H H H H H
charge: -0.286265 -0.308104 -0.308122 -0.292058 -0.292110 -0.381605 -0.381448 -0.041396 -0.041652 -0.702035 -0.660754 -0.701783 -0.660631 -0.240299 -0.240070 -0.309933 -0.310045 0.294232 0.294149 0.242681 0.242787 0.224028 0.234091 0.204353 0.210428 0.201112 0.248292 0.234058 0.224023 0.204306 0.210516 0.201049 0.248089 0.318452 0.318405 0.198466 0.225455 0.198617 0.225006 0.234754 0.243001 0.234780 0.243180
chargesum: 0.00000
title: Mulliken charges with hydrogens summed into heavy atoms:
elementType: O O O O O N N C C C C C C C C C C C C
charge: -0.286265 -0.308104 -0.308122 -0.292058 -0.292110 -0.063153 -0.063043 0.201286 0.201135 -0.039563 -0.000922 -0.039396 -0.000977 0.183623 0.183552 0.167822 0.167915 0.294232 0.294149
polarizability: 2.22357997e+02 -2.47971270e-04 1.39805637e+02 5.04439644e-01 3.09223788e-02 1.40190221e+02
1716.lowfreq: -1.8384 -0.2695 -0.0009 0.0007 0.0009 6.7871 13.8517 15.8528 20.1156
frequency: 13.8384 15.7648 20.0608 29.2217 30.8133 46.6693 54.4757 65.0358 79.7387 97.8741 109.3729 109.6132 114.9939 142.6427 155.2419 208.1823 209.0067 214.3817 248.7031 249.9074 270.7665 281.5451 286.4294 297.7920 343.9237 390.2447 396.9356 406.1061 434.2564 444.2101 454.6627 514.3092 545.5866 546.1859 564.7902 648.0234 648.1782 699.8692 700.1366 814.4202 824.2962 835.7561 838.6194 878.0989 880.3222 917.6380 918.1170 926.3664 939.7023 945.2114 952.8217 958.1761 1029.4358 1043.2265 1059.8392 1080.2157 1106.9411 1112.0903 1134.1931 1140.3835 1141.0255 1151.5002 1151.9765 1187.6273 1187.8676 1198.2202 1204.4106 1207.8584 1209.5922 1274.9626 1277.6106 1306.0804 1312.9369 1314.8364 1334.7386 1352.8922 1354.7802 1374.3719 1377.0459 1377.1208 1395.8028 1395.8521 1407.9221 1453.7622 1454.7872 1462.2703 1462.5304 1466.5203 1466.9403 1469.7389 1471.0289 1481.7398 1486.1121 1486.3363 1487.0171 1488.0902 1497.3880 1667.2650 1667.5765 2941.3205 2948.2089 2976.4577 2976.7621 2981.5289 2981.6252 3002.9445 3005.5229 3022.9378 3023.3159 3042.6066 3043.1529 3070.2166 3070.4507 3081.9854 3082.0056 3093.1392 3093.4360 3095.8732 3096.1159 3123.9951 3124.2318 3559.1256 3559.2173
redmass: 3.8279 3.5118 3.3248 4.1023 3.5518 4.3660 6.2147 3.2130 4.1070 4.4462 2.3285 3.9372 4.5598 3.6254 3.3219 1.0455 1.0445 4.4681 1.1325 1.1173 4.4826 3.3114 3.7191 3.2520 2.6582 3.3952 3.1475 2.8864 3.5381 2.6648 2.6054 3.8202 1.1680 1.1684 4.7863 4.8526 4.8054 11.6449 11.6088 1.1636 1.1957 2.9183 2.6517 3.7992 3.7549 1.3057 1.2403 3.1065 1.8153 1.7242 1.9470 2.5878 4.1330 4.2261 7.2825 4.2497 3.1061 1.5580 1.7053 2.1439 2.0957 2.0924 2.1102 2.2922 2.3133 1.1839 1.2910 1.9881 2.2323 1.1090 1.1158 1.2089 1.4946 1.4771 1.2521 1.2482 1.2540 1.3050 1.2178 1.2178 1.2298 1.2304 1.4495 1.1302 1.1352 1.0775 1.0664 1.1036 1.0714 1.2164 1.2335 1.0825 1.0491 1.0482 1.2953 1.3519 1.0794 9.6368 9.6330 1.0555 1.0554 1.0377 1.0377 1.0362 1.0362 1.1062 1.1075 1.0851 1.0851 1.0578 1.0580 1.0981 1.0982 1.0989 1.0989 1.1001 1.1002 1.1000 1.1000 1.1086 1.1085 1.0773 1.0773
irintensity: 0.4667 0.8007 1.6033 0.7729 0.0712 1.3725 8.5981 7.1426 2.4634 0.6540 0.7958 3.9521 0.2761 0.0297 6.9322 0.0965 0.1631 0.8577 0.3479 0.1499 26.9131 7.7180 6.5613 24.2782 2.3129 3.8034 0.8190 11.8288 13.7771 1.3893 1.1347 0.1978 56.8183 170.7401 0.9061 2.3779 21.2640 18.7642 25.9159 0.0414 1.6920 0.3099 8.4137 0.4976 20.8314 10.6777 3.6900 9.4594 9.4718 1.6923 13.3420 1.1892 200.4233 81.4560 536.5262 16.1488 0.6182 3.2619 35.9728 34.5530 2.8021 59.0120 0.9268 0.4952 2.4793 5.0740 159.0009 250.7321 45.7889 0.8700 5.9521 11.3410 0.3316 36.6636 0.0993 11.6231 7.2927 1.5961 24.6891 25.2173 64.6778 6.5898 0.3555 43.0575 0.2281 49.9784 27.7400 107.0658 37.1237 266.3077 48.6376 16.3323 19.3175 22.0362 167.7557 87.8255 1.6081 25.7982 518.5814 28.0956 61.8964 23.5024 23.4681 36.6486 18.6315 66.9500 1.1874 1.9922 1.8933 6.2231 52.7639 11.9495 12.3473 64.2543 61.7616 20.4180 20.5782 45.7082 36.5262 1.6716 25.4288 44.4711 20.0020
temp: 298.150 k
press: 1.00000 atm
elementType: 8 8 8 8 8 7 7 6 6 6 6 6 6 6 6 6 6 6 6 1 1 1 1 1 1 1 1 1 1 1 1 1 1 1 1 1 1 1 1 1 1 1 1
symmnumber: 1
zpe: 950359.3 jmol-1
zpe.correction: 0.361973 hartree
zpe.thermalcorrener: 0.385765 hartree
zpe.thermalcorrenthalpy: 0.386709 hartree
zpe.thermalcorrgfe: 0.302916 hartree
zpe.sumelectzpe: -955.770307 hartree
zpe.sumelectthermal: -955.746515 hartree
zpe.sumelectthermalent: -955.745571 hartree
zpe.sumelectthermalfe: -955.829364 hartree
dipole: -0.0078 2.7379 -0.0033
dipole: 2.7379
quadrupole: -72.6461 -112.4209 -120.3762
quadrupole: 0.0481 18.1334 -0.0061
quadrupole: 29.1684 -10.6065 -18.5618 0.0481 18.1334 -0.0061
hfenergy: -956.13228 hartree
pointgroup: C01 [X(C12H24N2O5)]
dipole: 0.0005923 1.0768723 -0.025761 debye
polarizability: 219.7676666|0.0617133|139.8072754|14.3661321|0.0512263|142.778914 unknown
InChI: InChI=1S/C12H24N2O5/c1-9(2)13-11(15)18-7-5-17-6-8-19-12(16)14-10(3)4/h9-10,13-14H,5-8H2,1-4H3
charge 0 multiplicity 1
43 atoms
O  -0.005869 -1.805457 0.035224
O  -3.32541 -1.29573 -1.543104
O  3.317984 -1.244319 1.586103
O  -4.276274 -0.739674 0.55351
O  4.277278 -0.797069 -0.532592
N  -5.256117 -0.095862 -1.483939
N  5.256432 -0.060624 1.473487
C  -6.442108 0.569575 -0.898746
C  6.448756 0.56629 0.859515
C  -6.915186 1.688841 -1.847538
C  -7.563619 -0.451454 -0.592874
C  6.925034 1.731114 1.750074
C  7.565299 -0.476112 0.612972
C  -1.126535 -0.996712 -0.454792
C  1.120569 -0.98177 0.485527
C  -2.225241 -1.994098 -0.838792
C  2.213926 -1.96718 0.913186
C  -4.303277 -0.703039 -0.705182
C  4.301576 -0.699233 0.722887
H  -6.10687 1.01213 0.057516
H  6.12026 0.959815 -0.120194
H  -7.782772 2.214195 -1.41198
H  -6.114026 2.427982 -2.025091
H  -7.233034 1.274488 -2.824295
H  -8.416574 0.048041 -0.09786
H  -7.931094 -0.923663 -1.523107
H  -7.188067 -1.241204 0.080244
H  6.12664 2.481687 1.887679
H  7.795488 2.230045 1.289746
H  7.23966 1.366201 2.747409
H  8.422605 -0.009385 0.094099
H  7.927311 -0.899255 1.568602
H  7.186872 -1.299115 -0.01737
H  -5.170821 -0.18297 -2.497932
H  5.168038 -0.096886 2.490297
H  -0.818659 -0.402867 -1.342402
H  -1.489625 -0.307461 0.335946
H  0.818279 -0.345694 1.345334
H  1.485857 -0.331884 -0.336931
H  -1.843609 -2.728885 -1.564259
H  -2.616661 -2.50219 0.058593
H  1.828126 -2.667135 1.670232
H  2.602758 -2.516283 0.039193
