program: Gaussian 09
title: 000235136
version: EM64L-G09RevD.01
frameworkgroup: C1[X(C7H14N2O4)]
method: RPBEPBE
basis: SDD
operation: Freq
keyword: #p
keyword: freq=noraman
keyword: PBEPBE/SDD
title: #p freq=noraman PBEPBE/SDD
converged: YES YES NO NO
title: Mulliken charges:
elementType: O O O O N N C C C C C C C H H H H H H H H H H H H H H
charge: -0.300539 -0.208891 -0.146853 -0.199776 -0.171591 0.140713 -0.036758 0.039965 -0.691287 -0.665704 0.341725 -0.675206 -0.683003 0.259185 0.245133 0.224219 0.238837 0.231362 0.226804 0.215350 0.251584 0.221337 0.255448 0.214516 0.215534 0.237652 0.220242
chargesum: 0.00000
title: Mulliken charges with hydrogens summed into heavy atoms:
elementType: O O O O N N C C C C C C C
charge: -0.300539 -0.208891 -0.146853 -0.199776 -0.171591 0.140713 0.222427 0.285098 0.003132 0.028034 0.341725 0.016094 -0.009574
polarizability: 1.36474983e+02 -9.99692132e-01 1.11831021e+02 7.55494991e-02 1.84195931e+00 8.38070285e+01
1716.lowfreq: -8.0076 -7.5580 -0.0003 -0.0001 0.0001 6.5551 24.9506 44.6220 62.4322
frequency: 24.7777 44.6154 62.4192 69.8844 91.4941 110.3683 156.2242 199.2728 202.1160 219.4060 229.3529 237.7991 264.2758 286.0831 316.0678 378.7667 388.2005 408.6160 450.6879 455.1629 466.8242 564.0547 659.9551 669.1979 702.3404 772.4086 776.0288 874.6305 890.4530 927.5248 930.0220 940.7327 945.8854 953.3227 1036.1591 1077.0953 1104.3546 1151.3933 1157.5552 1164.1157 1178.5310 1190.9215 1204.8229 1321.5802 1327.0925 1337.8918 1376.9787 1379.3107 1382.4600 1394.6047 1398.5627 1440.0223 1457.9609 1459.7188 1464.9539 1473.5384 1473.6854 1476.9319 1486.1502 1494.7732 1641.6519 2990.3495 2993.5729 2994.8185 2997.2588 3036.2389 3050.6121 3084.7528 3086.2298 3091.8100 3095.6141 3101.3862 3105.9933 3110.7894 3118.2165
redmass: 4.9341 2.9932 3.6690 5.4797 5.4237 4.0449 3.2122 1.1977 1.0316 2.5323 1.4840 1.2146 2.0174 3.5316 3.5463 3.5705 4.0673 3.3564 3.7545 2.9721 4.6922 3.5271 10.2572 9.8731 9.5320 4.6588 7.8705 3.0312 2.5391 1.2348 1.2337 1.4132 1.3809 3.6198 4.9502 2.5881 1.7974 2.5567 2.1153 4.3635 2.2648 2.5833 2.5532 1.3283 1.3402 1.4050 1.2247 1.3190 1.2709 1.2106 1.2297 9.6301 1.0534 1.0448 1.0471 1.0511 1.0603 1.0479 1.0496 1.0521 11.9992 1.0359 1.0358 1.0361 1.0361 1.0869 1.0841 1.0995 1.0996 1.0994 1.0987 1.1006 1.1005 1.1005 1.0992
irintensity: 0.6837 0.0115 0.6235 1.1519 0.1288 2.3286 1.0680 0.0472 0.0813 1.0896 1.6819 0.5430 2.8468 1.4976 3.4693 3.4432 2.6115 2.3953 4.0754 3.0720 13.8040 12.9540 10.8824 3.5457 28.4394 69.5923 62.8351 61.7424 27.9151 1.4607 5.4770 4.3474 2.4387 51.1408 512.1063 394.7404 22.0206 17.4885 14.7327 23.6245 92.0995 26.4206 131.6281 4.9383 2.1907 3.0978 24.5633 30.1792 45.8241 11.8560 27.0762 121.6031 5.8528 3.6634 4.6747 11.2119 2.2777 4.2649 34.9737 6.1251 265.6276 11.2063 24.9366 16.1577 18.1591 3.5409 5.8281 6.9682 16.6916 33.8672 51.2847 16.1401 28.0164 3.6355 23.5715
temp: 298.150 k
press: 1.00000 atm
elementType: 8 8 8 8 7 7 6 6 6 6 6 6 6 1 1 1 1 1 1 1 1 1 1 1 1 1 1
symmnumber: 1
zpe: 565710.6 jmol-1
zpe.correction: 0.215468 hartree
zpe.thermalcorrener: 0.230823 hartree
zpe.thermalcorrenthalpy: 0.231768 hartree
zpe.thermalcorrgfe: 0.172044 hartree
zpe.sumelectzpe: -684.397462 hartree
zpe.sumelectthermal: -684.382106 hartree
zpe.sumelectthermalent: -684.381162 hartree
zpe.sumelectthermalfe: -684.440886 hartree
dipole: -4.6367 4.3486 0.0870
dipole: 6.3574
quadrupole: -79.1628 -83.5927 -75.9364
quadrupole: 7.3384 1.1019 1.0628
quadrupole: 0.4012 -4.0287 3.6276 7.3384 1.1019 1.0628
hfenergy: -684.61293 hartree
pointgroup: C01 [X(C7H14N2O4)]
dipole: -1.9148401 1.5320503 0.4921951 debye
polarizability: 135.6057311|1.7967919|110.8692507|-6.6160817|5.2549652|85.638051 unknown
InChI: InChI=1S/C7H14N2O4/c1-5(2)8(9(11)12)7(10)13-6(3)4/h5-6H,1-4H3
charge 0 multiplicity 1
27 atoms
O  -1.26991 0.076478 -0.212196
O  -0.171822 -1.949828 0.202962
O  2.172876 -1.667348 -1.153815
O  3.347013 0.115837 -0.347039
N  1.021544 0.09385 -0.11112
N  2.26202 -0.542377 -0.56188
C  1.090979 1.559103 0.222407
C  -2.607968 -0.617388 -0.029988
C  0.411887 1.862748 1.573836
C  0.565068 2.428261 -0.94106
C  -0.145319 -0.724922 -0.025175
C  -2.918798 -0.734416 1.468002
C  -3.601089 0.241606 -0.813587
H  2.173667 1.73892 0.337732
H  -2.501059 -1.622584 -0.477003
H  0.632808 2.908669 1.851602
H  -0.681979 1.744651 1.515328
H  0.804664 1.207849 2.371526
H  1.104974 2.204361 -1.877953
H  0.728014 3.494378 -0.699821
H  -0.511493 2.260298 -1.101998
H  -3.905706 -1.212952 1.604587
H  -2.16597 -1.355275 1.981625
H  -2.952623 0.263401 1.940902
H  -4.603767 -0.220451 -0.771883
H  -3.300463 0.325316 -1.871582
H  -3.669252 1.256814 -0.384509
