program: Gaussian 09
title: 000235130
version: EM64L-G09RevD.01
frameworkgroup: C1[X(C5H10N2O4)]
method: RPBEPBE
basis: SDD
operation: Freq
keyword: #p
keyword: freq=noraman
keyword: PBEPBE/SDD
title: #p freq=noraman PBEPBE/SDD
converged: YES YES NO NO
title: Mulliken charges:
elementType: O O O O N N C C C C C H H H H H H H H H H
charge: -0.302800 -0.207333 -0.134722 -0.193822 -0.130858 0.132026 -0.332234 -0.651859 0.356459 -0.218880 -0.670083 0.251314 0.249356 0.246656 0.226505 0.224743 0.236257 0.237728 0.219500 0.232083 0.229962
chargesum: 0.00000
title: Mulliken charges with hydrogens summed into heavy atoms:
elementType: O O O O N N C C C C C
charge: -0.302800 -0.207333 -0.134722 -0.193822 -0.130858 0.132026 0.168436 0.046045 0.356459 0.255106 0.011462
polarizability: 1.15319861e+02 -2.33313196e-01 9.37789229e+01 7.35042852e-01 -3.66894461e+00 5.65810073e+01
1716.lowfreq: -0.0011 -0.0009 -0.0007 4.0793 9.6019 15.8078 29.6244 52.1118 65.8995
frequency: 29.4706 51.9855 65.8669 81.2746 107.9880 129.7371 159.3823 217.4288 250.9302 255.9055 320.5063 382.8840 396.0178 411.6145 443.7345 587.4449 661.5263 670.2289 687.6530 768.2056 786.6896 801.1372 815.3848 943.8533 971.7377 1030.2922 1059.3189 1090.4841 1110.6547 1135.0904 1138.0641 1159.5230 1215.7250 1251.6584 1325.5482 1352.5723 1364.0916 1391.1639 1401.3272 1434.0579 1456.4688 1463.8870 1473.0559 1475.7418 1482.4177 1488.1762 1656.2853 2996.6468 2997.9582 3017.4160 3055.9191 3077.1359 3093.8430 3095.1687 3101.6008 3110.8834 3127.3071
redmass: 4.0930 5.2301 2.9720 4.3017 2.9373 3.6022 3.6072 1.0746 1.2447 5.8148 5.5460 3.3148 3.0978 5.5661 6.5406 4.2436 5.7736 8.3381 10.3853 3.5291 1.8503 1.1009 3.4449 2.7771 2.4972 2.7923 6.1447 2.0908 2.3617 2.3586 1.5270 8.9508 2.9930 1.1304 1.2407 1.2831 1.3589 1.2300 1.2629 4.5784 1.2181 1.0404 1.0655 1.0583 1.0514 1.0726 12.1452 1.0357 1.0358 1.0582 1.0615 1.1067 1.0977 1.0984 1.1013 1.1034 1.1047
irintensity: 0.1128 0.4017 0.3840 0.3980 1.9479 2.8551 3.6145 0.0580 1.0621 1.7753 5.7600 7.0104 1.7840 1.9408 6.5637 9.3708 2.3247 4.4982 22.2997 111.4053 7.9538 4.1179 56.2078 60.4218 4.6742 105.2344 795.5434 24.7085 11.1882 20.8246 4.2088 62.3617 145.5353 0.0424 37.8477 3.9829 8.0236 32.9213 22.1365 125.3454 19.7109 12.6424 11.3241 3.2473 7.5442 16.2325 288.8294 16.9450 17.2379 16.6662 8.2514 3.5387 32.6841 23.7829 8.7722 42.3752 7.5043
temp: 298.150 k
press: 1.00000 atm
elementType: 8 8 8 8 7 7 6 6 6 6 6 1 1 1 1 1 1 1 1 1 1
symmnumber: 1
zpe: 422449.7 jmol-1
zpe.correction: 0.160903 hartree
zpe.thermalcorrener: 0.173380 hartree
zpe.thermalcorrenthalpy: 0.174325 hartree
zpe.thermalcorrgfe: 0.120628 hartree
zpe.sumelectzpe: -605.944820 hartree
zpe.sumelectthermal: -605.932342 hartree
zpe.sumelectthermalent: -605.931398 hartree
zpe.sumelectthermalfe: -605.985094 hartree
dipole: 4.7642 3.8166 -0.6949
dipole: 6.1438
quadrupole: -65.2781 -69.7001 -63.0119
quadrupole: -4.8528 0.5643 1.4617
quadrupole: 0.7186 -3.7034 2.9848 -4.8528 0.5643 1.4617
hfenergy: -606.1057227 hartree
pointgroup: C01 [X(C5H10N2O4)]
dipole: 1.8556477 1.5348735 -0.2084379 debye
dipolederiv: -1.7781395 -0.1636775 0.0488113 -0.3319531 -0.5133048 0.0807113 0.0660602 0.074418 -0.3129599 -0.6157242 0.1421192 -0.0230515 0.0859201 -0.8533762 0.1887224 -0.0000601 0.2343556 -0.3661747 -0.441614 -0.1352487 0.0095563 -0.296112 -0.8371683 -0.0401733 0.0288352 -0.021611 -0.1473956 -0.9189407 0.1853203 -0.0153247 0.2736994 -0.5629268 -0.0151322 0.0053118 -0.0303889 -0.1993136 -1.8099522 0.0127883 -0.1010884 0.0917458 -0.6400992 -0.0429935 -0.1552691 0.0548326 -0.2527506 2.1597641 0.1851072 0.0190061 0.5353687 1.3267938 0.1120532 -0.1201472 0.0651398 0.1646632 0.0468867 0.0065537 -0.0051532 -0.0206875 0.5311195 0.0684611 0.0261721 0.0298772 0.2514591 0.0516475 -0.0116262 0.0004579 0.0065417 -0.0473249 -0.0324219 0.0310838 -0.0466375 -0.061094 2.2950883 -0.1929093 0.0609751 -0.1942043 1.1952492 -0.3574745 0.0510316 -0.3605881 0.4544422 1.0570167 -0.0160033 0.0100036 -0.1622495 0.2554486 0.0258998 0.091651 0.0320217 0.3287646 -0.1325507 -0.0750063 0.0210418 -0.0548877 0.0011655 0.0165229 0.0061632 0.0167886 0.0569441 0.0429585 -0.0496311 0.1072287 -0.0510143 0.0312643 -0.028497 0.0914785 -0.0302606 0.0430511 0.002803 0.0523498 -0.1185693 -0.0059756 0.0384279 -0.0197798 -0.050655 -0.0242805 0.0215451 -0.0447134 -0.0047799 0.1074064 -0.0561495 0.1107834 0.0233576 0.0536497 0.0076307 0.0306554 -0.0381339 0.0246917 -0.1180414 0.0598354 0.0806937 0.0348521 -0.0878631 0.0095761 -0.0034707 0.1119572 -0.0185747 0.0016239 -0.006833 -0.1659864 0.0382413 -0.0001181 0.0397482 0.0725676 -0.0463187 -0.018349 0.0392528 0.0492666 0.0539078 0.0438566 -0.0288893 0.0587946 -0.1014102 -0.0503635 -0.0269164 -0.0133204 0.0633798 -0.0607202 -0.0797754 -0.0123565 -0.0942558 0.0150018 -0.1271769 0.0634207 -0.0331732 0.0795815 0.0546653 0.0282649 -0.0408886 0.0269123 0.108709 0.1189293 0.0021993 -0.0322442 -0.041691 0.0688996 0.0534208 0.0152742 0.066972 -0.1194934 0.1165766 0.0381723 0.0346023 -0.0235817 -0.0675121 -0.0981164 0.0295355 -0.109045 0.0162596 unknown
polarizability: 115.3110368|0.0369681|93.9884288|1.1303569|-2.3366288|56.3803258 unknown
InChI: InChI=1S/C5H10N2O4/c1-3-6(7(9)10)5(8)11-4-2/h3-4H2,1-2H3
charge 0 multiplicity 1
21 atoms
O  1.546215 0.163453 -0.198592
O  0.485713 -1.80816 0.487465
O  -2.132723 -1.774313 -0.166179
O  -3.039713 0.324843 -0.141843
N  -0.734941 0.118346 -0.256914
N  -2.053361 -0.503776 -0.172984
C  -0.712629 1.588949 -0.494414
C  -0.757763 2.40761 0.809097
C  0.428567 -0.643242 0.052707
C  2.863138 -0.488961 0.102699
C  3.939411 0.543411 -0.210951
H  0.210669 1.792526 -1.057221
H  -1.580216 1.824824 -1.130903
H  -1.693898 2.22088 1.361067
H  0.101621 2.163919 1.457546
H  -0.708939 3.484586 0.567686
H  2.860699 -0.795282 1.163927
H  2.946156 -1.396614 -0.520988
H  4.934982 0.111095 -0.003213
H  3.90702 0.841421 -1.272667
H  3.817693 1.445886 0.411977
