program: Gaussian 09
title: 000235129
version: EM64L-G09RevD.01
frameworkgroup: C1[X(C5H9N3O5)]
method: RPBEPBE
basis: SDD
operation: Freq
keyword: #pfreq=noraman
keyword: PBEPBE/SDD
title: #p freq=noraman PBEPBE/SDD
converged: YES YES NO NO
title: Mulliken charges:
elementType: O O O O O N N N C C C C C H H H H H H H H H
charge: -0.239371 -0.255987 -0.185292 -0.191254 -0.207367 -0.203663 0.141584 0.121046 -0.397422 -0.348586 0.351935 -0.233151 -0.663721 0.280270 0.285403 0.301879 0.276594 0.236406 0.238536 0.216996 0.237525 0.237642
chargesum: 0.00000
title: Mulliken charges with hydrogens summed into heavy atoms:
elementType: O O O O O N N N C C C C C
charge: -0.239371 -0.255987 -0.185292 -0.191254 -0.207367 -0.203663 0.141584 0.121046 0.168251 0.229886 0.351935 0.241791 0.028442
polarizability: 1.22222412e+02 -2.52667262e+00 1.00356820e+02 1.51681716e+00 4.33639493e-01 7.50400589e+01
1716.lowfreq: -8.8126 -6.0620 -5.6310 -0.0011 -0.0006 -0.0004 20.9598 32.7884 36.2007
frequency: 20.8349 32.6817 36.1357 55.4367 71.9529 88.0785 115.5217 144.0716 184.1980 222.6271 249.5733 275.3963 323.6836 341.8726 375.2809 443.8172 479.2127 493.7316 542.5092 652.2642 706.1106 713.8698 778.3870 788.9159 801.2831 831.6799 861.9293 913.2668 1013.7455 1067.2768 1085.9809 1116.1387 1118.6990 1135.8562 1221.4793 1227.9637 1253.0171 1274.7734 1290.7513 1322.3456 1355.3913 1372.0744 1388.3929 1405.0497 1422.4522 1439.5989 1451.3682 1462.1357 1472.8094 1486.2232 1611.5593 3001.3903 3017.0542 3037.8980 3052.3312 3079.6738 3098.4685 3107.2995 3115.9806 3131.2055
redmass: 13.1346 3.7870 6.5251 2.4384 3.6115 4.2931 4.2627 3.7625 8.2961 4.6283 1.4401 6.3363 2.6771 5.9467 5.2900 11.2295 5.8570 6.8378 3.6511 8.1881 8.3945 2.6841 4.4262 2.4203 1.1004 4.5943 5.8599 3.7355 2.1731 4.0888 4.6254 2.2628 2.6405 1.4509 1.5726 3.6124 1.1339 1.9477 1.5391 1.4449 1.5354 1.9512 4.7992 1.2814 2.4518 1.2009 1.2590 1.0391 1.0665 1.0687 10.3860 1.0361 1.0581 1.0595 1.0585 1.1074 1.0985 1.1050 1.1031 1.1055
irintensity: 0.1101 0.0569 0.8401 4.5537 0.4011 1.0407 3.9786 12.6806 1.7033 1.2824 1.4442 24.6689 1.7922 9.3777 6.4902 9.0460 6.1015 28.9210 0.9690 33.7563 22.6783 9.1024 47.1347 102.5061 3.8590 15.7537 37.6997 132.2708 31.9553 52.2707 227.6398 11.9551 87.7679 6.2851 72.4985 57.5727 0.1234 208.6202 44.3756 104.5037 29.0494 127.9325 119.3029 15.9051 131.5587 56.7813 5.7248 13.4279 4.1766 19.2488 194.0932 14.2390 15.3472 5.4368 1.8288 5.8075 22.3556 1.3619 35.8574 1.0415
temp: 298.150 k
press: 1.00000 atm
elementType: 8 8 8 8 8 7 7 7 6 6 6 6 6 1 1 1 1 1 1 1 1 1
symmnumber: 1
zpe: 413792.5 jmol-1
zpe.correction: 0.157605 hartree
zpe.thermalcorrener: 0.171966 hartree
zpe.thermalcorrenthalpy: 0.172910 hartree
zpe.thermalcorrgfe: 0.112883 hartree
zpe.sumelectzpe: -735.132878 hartree
zpe.sumelectthermal: -735.118517 hartree
zpe.sumelectthermalent: -735.117573 hartree
zpe.sumelectthermalfe: -735.177600 hartree
dipole: 5.2240 -1.2607 0.3852
dipole: 5.3877
quadrupole: -80.9171 -85.4609 -74.7237
quadrupole: -9.1160 -0.3489 -1.8107
quadrupole: -0.5499 -5.0937 5.6435 -9.1160 -0.3489 -1.8107
hfenergy: -735.290483 hartree
pointgroup: C01 [X(C5H9N3O5)]
dipole: 2.0650046 0.4418351 -0.1833616 debye
dipolederiv: -1.8806519 -0.253017 0.1714446 0.0432707 -0.3869832 -0.0213233 0.2762454 0.0294156 -0.292318 -0.7766483 -0.0126381 0.0343853 0.1394257 -0.9572296 -0.1266201 0.0403076 -0.0873351 -0.3394361 -0.6744968 0.1977328 -0.2199534 0.1399104 -0.2932814 0.169121 -0.0951398 0.135828 -0.6446902 -0.5184167 0.0563212 0.1598717 0.1098494 -0.2424528 0.0959604 -0.073304 0.1580512 -0.7447642 -0.3657249 -0.8239593 -0.08895 -0.0926519 -0.9625118 -0.109783 0.0152609 -0.0071104 -0.1525882 -0.6175377 -0.0310459 0.0246771 -0.5782478 -1.4109393 -0.109308 -0.1037173 -0.2257091 -0.1765217 1.0629776 -0.2607312 0.005489 -0.2539247 0.2364173 -0.2761751 0.0311047 -0.2605353 1.1892204 0.0272312 0.3328593 0.0101716 0.2149855 1.7645841 0.2727404 0.0651573 0.3001676 0.0382517 0.3477108 -0.0629863 0.0142993 -0.016701 -0.0404121 -0.0202875 -0.0019496 0.0368059 0.1668065 -0.0250708 0.0327539 0.1030383 -0.059572 0.2287326 0.0307709 0.2653033 -0.0561661 0.0206685 2.2532358 0.6043464 -0.1258398 0.0828205 1.4809364 0.1671874 -0.2557181 0.0496729 0.3529655 1.0034924 0.2047345 -0.0644446 0.379457 0.3454893 -0.0494614 -0.0623413 -0.0342558 0.3481623 -0.1503549 0.0379144 0.0330288 0.0173023 0.0197624 -0.008136 0.0339793 -0.008248 0.0460838 0.0542452 0.0045641 0.0141198 -0.0789538 0.0420648 0.0423491 -0.0286543 0.0081075 0.1017504 0.0692654 0.0214351 -0.0201307 0.0341503 0.0758801 -0.0655534 -0.0406884 -0.0389271 0.0356314 0.0932665 -0.010367 0.0123469 0.0207851 0.0112833 0.0371231 0.0111159 0.00837 0.0986245 0.0349331 0.0131902 -0.0304601 0.0286425 0.0521383 -0.0598287 -0.0398423 -0.0320011 0.0224887 -0.0519843 0.0367687 -0.0516398 -0.0553238 -0.0257311 0.0830403 -0.0293903 0.0942913 -0.0209584 -0.0260083 -0.0025475 0.0471072 -0.0834015 0.0109334 -0.0558718 0.0106341 -0.0873342 -0.0717224 -0.0660625 -0.1016255 0.0174161 -0.118886 -0.0113363 0.0052117 0.0180256 0.002549 0.1196984 0.1020141 0.0236461 -0.0115949 0.08097 0.0109536 0.0967665 -0.0333434 0.1085683 -0.0272137 0.1045846 -0.007349 -0.0343824 0.0460932 0.051702 -0.0979226 -0.0030453 -0.0942049 -0.0701394 unknown
polarizability: 122.2964214|1.9511066|100.2544749|-2.0314188|-0.1735729|75.0683951 unknown
InChI: InChI=1S/C5H9N3O5/c1-2-13-5(9)7(6-10)3-4-8(11)12/h2-4H2,1H3
charge 0 multiplicity 1
22 atoms
O  2.512759 -0.089089 -0.07601
O  0.940076 1.584038 0.392157
O  -4.067225 1.066565 -1.126946
O  -3.694417 0.419465 1.030724
O  -0.278518 -2.813962 -0.137831
N  0.274207 -0.650776 0.214239
N  -3.318542 0.624683 -0.182438
N  0.676943 -1.981141 -0.165731
C  -1.111091 -0.324745 0.620945
C  -1.86305 0.338029 -0.547416
C  1.254125 0.385333 0.187953
C  3.59123 0.960513 -0.141229
C  4.891086 0.218789 -0.421831
H  -1.595612 -1.272655 0.908346
H  -1.080171 0.348686 1.489765
H  -1.418493 1.312621 -0.811028
H  -1.897437 -0.299388 -1.446113
H  3.322373 1.674628 -0.939827
H  3.601199 1.497763 0.823557
H  5.722971 0.943857 -0.479922
H  5.114724 -0.504201 0.380307
H  4.836962 -0.326815 -1.37867
