program: Gaussian 09
title: 000235066
version: EM64L-G09RevD.01
frameworkgroup: C1[X(C15H20ClNO4)]
method: RPBEPBE
basis: SDD
operation: Freq
keyword: #p
keyword: freq=noraman
keyword: PBEPBE/SDD
title: #p freq=noraman PBEPBE/SDD
converged: YES YES NO NO
title: Mulliken charges:
elementType: Cl O O O O N C C C C C C C C C C C C C C C H H H H H H H H H H H H H H H H H H H H
charge: -0.065519 -0.436688 -0.292382 -0.220411 -0.263211 -0.393342 -0.012178 -0.430236 -0.118160 -0.714426 -0.730420 0.164674 0.173334 -0.450419 0.228222 0.335089 -0.313904 -0.366615 -0.782327 -0.241672 -0.110341 0.196417 0.240683 0.213669 0.297276 0.206089 0.241023 0.215687 0.233804 0.227108 0.213353 0.370476 0.246907 0.264143 0.391226 0.261534 0.262235 0.219917 0.235971 0.245122 0.258291
chargesum: 0.00000
title: Mulliken charges with hydrogens summed into heavy atoms:
elementType: Cl O O O O N C C C C C C C C C C C C C C C
charge: -0.065519 -0.045463 -0.292382 -0.220411 -0.263211 -0.022865 0.184239 0.024117 0.179115 -0.051627 -0.056154 0.164674 0.173334 0.060631 0.228222 0.335089 -0.052370 -0.104380 -0.081317 0.016619 -0.110341
polarizability: 2.15418586e+02 3.01024244e+01 1.75957655e+02 -1.00421275e+01 6.77119153e+00 1.75350945e+02
1716.lowfreq: -9.5484 -0.0012 -0.0006 -0.0003 1.0397 3.5454 10.2599 16.8276 28.5836
frequency: 10.1594 16.4874 28.3483 35.6507 42.8669 64.5869 65.6312 83.9096 98.1983 101.3444 132.5709 159.9166 180.5879 190.1584 197.8777 224.8284 233.9795 251.8043 265.1884 281.1556 297.0820 324.6813 342.5622 359.1292 378.1226 380.5583 432.4762 444.6730 477.5403 497.5839 518.3533 547.7912 556.8146 565.0333 583.0771 601.3631 620.4036 665.0510 694.5395 711.0237 716.0237 730.9488 758.9134 805.0956 806.4572 854.3864 876.6894 900.8857 920.3803 928.8583 930.3281 954.5616 971.8574 988.4363 992.4979 996.2652 1004.5880 1044.7729 1060.3474 1089.2495 1094.3487 1124.3827 1130.2783 1133.9966 1174.0740 1198.1854 1218.0337 1222.8875 1234.4706 1240.9604 1270.3328 1277.9756 1299.8970 1310.9622 1325.2832 1333.4201 1340.6134 1358.4706 1376.5540 1383.1493 1391.9442 1401.4898 1402.1104 1450.4232 1456.6006 1457.5838 1467.7450 1468.4650 1476.2591 1485.9184 1487.6718 1494.5457 1499.7800 1588.2642 1601.5456 1614.0472 1677.0673 2959.0906 2973.8340 2977.5989 2985.2960 2989.7379 3020.1880 3045.9089 3063.1780 3064.3167 3068.3627 3071.4716 3073.8647 3089.6993 3089.9884 3097.3017 3156.1512 3157.3116 3178.6447 3521.0385 3525.3236
redmass: 5.0041 7.7111 3.4986 3.7940 6.9663 9.8186 6.2697 5.1021 3.2413 1.1151 4.7110 4.0528 4.7174 3.7141 4.2542 3.5634 1.1854 3.8972 1.0814 4.5511 4.7108 3.9028 6.3063 1.9658 4.7689 2.7410 4.1565 3.1233 5.3383 5.0383 2.5994 3.5089 3.4182 3.3232 3.5307 1.5917 6.1691 3.4117 1.2162 3.7677 3.8616 4.9528 3.0711 1.6395 2.2276 6.1287 1.3414 2.0555 1.3649 3.5478 1.3387 1.6260 1.9100 5.4578 1.6570 2.2645 2.1072 1.5209 1.9243 2.0161 3.5808 2.3437 2.0011 1.8912 1.8344 1.7977 1.4989 1.6934 1.5786 1.6166 1.2897 1.8372 1.6707 1.2488 1.2905 1.5487 1.3621 1.3714 6.9882 1.2067 3.0598 1.2726 1.2110 1.0937 1.0463 1.0868 1.8702 1.0515 1.3677 1.1467 1.0611 1.7947 1.0639 6.7475 7.2601 9.1579 8.7534 1.0807 1.0356 1.0382 1.0370 1.0611 1.0585 1.1004 1.0965 1.0980 1.0916 1.0983 1.0979 1.0983 1.1052 1.1001 1.0913 1.0899 1.0968 1.0776 1.0645
irintensity: 0.1293 0.0679 0.0334 1.2293 3.6330 4.6753 0.1612 0.1153 0.2900 0.0603 0.4558 0.7769 2.4292 1.9451 8.0932 0.7393 0.1054 8.1364 0.1627 4.8246 8.5941 0.9349 4.7422 0.1742 0.8290 0.8225 1.2490 4.9660 33.3010 7.8975 0.4687 5.3339 7.9791 16.7911 34.5224 109.2144 64.3816 3.9534 96.1695 1.4322 39.5170 3.6049 6.3561 45.7153 11.6047 39.8859 16.2095 12.4640 3.2462 89.4429 0.4369 0.4667 2.8297 27.9944 8.7466 1.6423 1.1814 6.8383 130.5796 3.6894 10.3855 121.7024 46.5369 2.5931 97.0696 7.5318 1.4374 9.5688 48.6067 49.5620 4.7155 22.2188 44.2037 9.4108 8.5664 4.1015 3.8770 3.7307 3.9922 26.1998 17.4637 18.8354 13.2823 52.0674 14.4399 2.3601 76.6458 1.7629 147.5439 17.3049 40.0989 140.0200 33.3356 2.5473 6.9349 197.6925 194.2132 22.5250 33.3516 28.5516 23.2152 26.5115 21.5824 12.3305 17.4702 22.8779 18.2561 32.6778 42.2640 33.6721 7.6511 19.8049 6.4333 2.2073 1.6442 48.0855 39.3454
temp: 298.150 k
press: 1.00000 atm
elementType: 17 8 8 8 8 7 6 6 6 6 6 6 6 6 6 6 6 6 6 6 6 1 1 1 1 1 1 1 1 1 1 1 1 1 1 1 1 1 1 1 1
symmnumber: 1
zpe: 858755.4 jmol-1
zpe.correction: 0.327083 hartree
zpe.thermalcorrener: 0.349921 hartree
zpe.thermalcorrenthalpy: 0.350865 hartree
zpe.thermalcorrgfe: 0.270873 hartree
zpe.sumelectzpe: -1397.721569 hartree
zpe.sumelectthermal: -1397.698731 hartree
zpe.sumelectthermalent: -1397.697787 hartree
zpe.sumelectthermalfe: -1397.777779 hartree
dipole: 0.9404 1.2682 3.8773
dipole: 4.1864
quadrupole: -138.4100 -136.5072 -130.2133
quadrupole: -3.8828 2.3339 -0.7127
quadrupole: -3.3665 -1.4637 4.8302 -3.8828 2.3339 -0.7127
hfenergy: -1398.0486518 hartree
pointgroup: C01 [X(C15H20Cl1N1O4)]
dipole: -0.8335096 -1.391817 -0.2844176 debye
polarizability: 202.0305221|-14.0315154|184.1960485|34.9299419|-5.5208346|180.5006155 unknown
InChI: InChI=1S/C15H20ClNO4/c1-9(2)6-12(15(19)20)17-14(18)8-21-13-5-4-11(16)7-10(13)3/h4-5,7,9,12,17,19H,6,8H2,1-3H3
charge 0 multiplicity 1
41 atoms
Cl 5.705483 -0.397696 2.400338
O  -1.412445 -0.551174 1.478628
O  1.45434 -1.063648 -1.826802
O  -1.790949 1.609978 2.246075
O  -0.272331 2.130084 -2.465979
N  -0.674623 0.426895 -0.917222
C  -4.340508 1.713095 -0.3207
C  -3.12664 0.877038 -0.825097
C  -1.72425 1.166508 -0.192134
C  -4.951021 1.191497 1.004505
C  -4.020778 3.226169 -0.236575
C  -1.650172 0.822632 1.290191
C  -0.026839 0.976499 -1.995571
C  1.022409 0.066023 -2.660635
C  2.451119 -0.82555 -0.847077
C  2.968588 -2.001684 -0.230396
C  2.910354 0.461801 -0.486873
C  3.963191 -1.845245 0.761645
C  2.463073 -3.369678 -0.638008
C  3.907907 0.599263 0.506209
C  4.417871 -0.558572 1.11494
H  -5.116638 1.582257 -1.104486
H  -2.985528 1.083127 -1.903671
H  -3.344023 -0.203963 -0.720592
H  -1.50691 2.242627 -0.297974
H  -5.171208 0.108489 0.946017
H  -4.280713 1.365809 1.863782
H  -5.900956 1.715613 1.219115
H  -3.334939 3.443896 0.60301
H  -3.554889 3.594395 -1.169923
H  -4.945409 3.807404 -0.066101
H  -0.429235 -0.517786 -0.605694
H  1.876131 0.687932 -2.985222
H  0.569521 -0.400921 -3.551979
H  -1.367011 -0.754476 2.451402
H  2.50254 1.365156 -0.949401
H  4.383418 -2.729827 1.250126
H  3.00629 -4.167766 -0.105024
H  1.383718 -3.479206 -0.423754
H  2.580409 -3.526721 -1.72544
H  4.268555 1.590027 0.795349
