program: Gaussian 09
title: 000235046
version: EM64L-G09RevD.01
frameworkgroup: C1[X(C11H9NO3)]
method: RPBEPBE
basis: SDD
operation: Freq
keyword: #p
keyword: freq=noraman
keyword: PBEPBE/SDD
title: #p freq=noraman PBEPBE/SDD
converged: YES YES NO NO
title: Mulliken charges:
elementType: O O O N C C C C C C C C C C C H H H H H H H H H
charge: -0.186696 -0.192989 -0.198431 -0.230427 0.192705 0.185356 0.084102 0.087451 -0.440559 -0.352634 -0.352379 0.238432 -0.209124 -0.209252 -0.767690 0.278628 0.274211 0.272522 0.272009 0.241924 0.241904 0.261973 0.247911 0.261054
chargesum: 0.00000
title: Mulliken charges with hydrogens summed into heavy atoms:
elementType: O O O N C C C C C C C C C C C
charge: -0.186696 -0.192989 -0.198431 -0.230427 0.192705 0.185356 0.084102 0.087451 0.112281 -0.080112 -0.080371 0.238432 0.032800 0.032652 0.003247
polarizability: 1.85780874e+02 -8.04245345e-01 1.36654517e+02 -1.54507205e+01 1.63003569e+00 7.36785461e+01
1716.lowfreq: -4.6426 0.0007 0.0008 0.0008 4.7467 7.0721 27.8803 34.6644 54.4445
frequency: 27.8528 34.5645 54.4381 131.9805 137.5200 165.3356 178.7505 220.5844 247.0058 301.1292 307.5313 353.9766 410.8047 442.7862 455.3347 496.5270 523.3329 550.9822 617.7660 659.1516 677.3677 701.3868 720.6213 763.9834 785.5481 796.6066 806.1657 880.5534 908.5801 969.0135 976.4710 983.4411 1001.4302 1008.5748 1018.6190 1072.6378 1107.0363 1169.4356 1172.1226 1204.3516 1216.8204 1283.5536 1296.8238 1318.3576 1353.1857 1371.4810 1412.7328 1419.4225 1442.4618 1454.3377 1454.6644 1454.8020 1614.3991 1617.5430 1629.2416 1644.1905 1678.4277 2984.8705 3006.7756 3069.7505 3081.3239 3127.2172 3141.4451 3154.6471 3166.0047 3175.8686
redmass: 5.0258 4.7698 5.5994 6.3187 4.9252 1.0391 6.0247 2.7982 5.0289 4.6165 10.3249 7.5711 3.1110 2.4710 4.8233 3.2918 7.0972 7.7960 8.2424 4.8207 5.7963 4.6226 3.5023 3.4748 5.2494 1.7295 2.3998 3.1494 1.3917 4.4217 1.4121 1.9924 2.2756 1.3491 2.0114 2.6370 2.8146 1.1887 2.0108 3.1319 3.8483 1.4713 1.3796 1.5269 3.7023 1.3005 1.5573 2.3722 1.0772 1.9480 2.7503 1.1926 7.6658 7.9414 11.6229 8.7614 11.9984 1.0374 1.0604 1.0960 1.1004 1.1000 1.0866 1.0907 1.0957 1.1005
irintensity: 0.0617 5.3194 0.4792 10.5901 0.0059 0.3275 0.0889 3.3963 2.9926 3.8837 11.9422 4.4640 3.3089 1.9694 0.0586 12.4059 8.6501 3.4514 23.3985 0.0142 0.3670 29.4218 57.1149 8.6027 0.0445 27.3806 1.1406 25.0507 0.0043 10.7184 2.0570 3.6016 63.7253 0.0225 0.2977 12.1001 11.9176 8.7366 4.3397 24.2688 132.6496 2.4323 44.1143 33.4877 185.5082 76.4397 13.0470 35.3263 33.4581 0.5714 0.9803 43.0127 2.7862 86.3320 340.8321 203.3123 56.3841 1.6792 13.8720 5.7611 1.6661 13.9627 1.6259 4.6192 4.6577 18.0983
temp: 298.150 k
press: 1.00000 atm
elementType: 8 8 8 7 6 6 6 6 6 6 6 6 6 6 6 1 1 1 1 1 1 1 1 1
symmnumber: 1
zpe: 464220.8 jmol-1
zpe.correction: 0.176812 hartree
zpe.thermalcorrener: 0.189941 hartree
zpe.thermalcorrenthalpy: 0.190885 hartree
zpe.thermalcorrgfe: 0.135543 hartree
zpe.sumelectzpe: -703.962700 hartree
zpe.sumelectthermal: -703.949571 hartree
zpe.sumelectthermalent: -703.948627 hartree
zpe.sumelectthermalfe: -704.003969 hartree
dipole: -5.9905 0.1892 1.4097
dipole: 6.1570
quadrupole: -87.7481 -94.7157 -83.9026
quadrupole: 4.2190 0.0174 -0.9966
quadrupole: 1.0407 -5.9269 4.8862 4.2190 0.0174 -0.9966
hfenergy: -704.1395121 hartree
pointgroup: C01 [X(C11H9N1O3)]
dipole: 2.3533071 -0.2350322 0.5239979 debye
dipolederiv: -0.6134761 0.2672554 -0.0206156 0.1341096 -0.966629 0.017202 -0.0106351 0.0106047 -0.3289563 -0.5943768 -0.2351586 -0.0583849 -0.0974024 -1.0202878 -0.1126542 -0.0556185 -0.1014657 -0.3407281 -1.1028971 0.1044544 -0.0615997 0.1787879 -0.317022 0.0145963 -0.0060273 0.0099418 -0.540512 -1.0333232 0.0509036 -0.0677597 -0.0069128 -1.1760728 -0.0780374 -0.0360713 -0.0832896 -0.2669663 -0.4352837 0.1785981 -0.0453764 0.1756323 -0.0734176 0.0334193 -0.0768976 0.0280679 -0.0178151 -0.417727 -0.1831237 -0.0682701 -0.1885475 -0.0884968 -0.0456789 -0.1065135 -0.0386389 -0.0210287 1.2084184 -0.0096287 0.1288044 0.0872241 1.4434571 0.0265262 0.151654 0.0778063 0.2626782 1.2116928 -0.0561883 0.1366775 -0.1427458 1.486492 0.1493507 0.1542182 0.0950511 0.2632152 0.3857699 0.0225544 0.1189492 0.166704 0.0714525 -0.0810495 0.3889158 -0.0766739 -0.1134358 -0.0921629 -0.0915115 -0.0134335 0.0881 0.1354979 0.026482 0.0074164 -0.0022882 -0.0958462 -0.0871268 0.0739224 -0.0005982 -0.1032909 0.137645 0.0023506 -0.0060103 0.0316899 -0.0941467 1.2622534 -0.1949745 -0.0188521 -0.2747329 0.1433732 0.0161462 -0.2661065 0.0173123 1.0184519 0.1058207 0.1143563 0.0645881 0.088673 -0.0371377 0.0159358 0.0547675 0.0295477 -0.123006 0.1176306 -0.1076717 0.0504846 -0.0861294 -0.0446092 -0.0015823 0.045773 -0.0147606 -0.1286805 -0.1582438 0.017844 -0.1862099 0.0181873 0.0144171 -0.0090959 -0.0875595 0.0127055 -0.449002 -0.0311325 0.0056653 0.0123893 0.0259721 0.0650466 0.099373 -0.0207639 0.0414089 0.0397745 0.0563424 0.0219487 0.0338053 -0.096121 0.0415217 -0.0482726 -0.0010936 -0.0068705 0.1219732 0.1056709 0.028597 -0.0094514 -0.0131323 -0.0198067 -0.0145883 -0.0129939 -0.0076119 0.1549312 0.1060585 -0.0186879 -0.0127231 0.0236292 -0.0213022 -0.0089547 -0.0102625 -0.0162859 0.1554345 -0.0508046 -0.0738432 -0.0435882 -0.0801741 0.0495228 -0.0232739 -0.0466514 -0.0226213 0.1482269 -0.0616368 0.0725721 -0.0353156 0.078089 0.0560781 0.0078875 -0.0368903 0.0071924 0.151871 -0.0285006 0.0078299 0.118089 0.0149691 0.1282281 0.0065223 0.0833987 0.0033752 0.0039031 0.0843091 0.0939873 -0.0031852 0.1126011 -0.0208707 0.021767 -0.0491809 -0.0356477 0.0907174 0.0627252 -0.0897009 -0.0184238 -0.1034896 0.0129202 -0.0143713 -0.0568676 0.0414505 0.1089464 unknown
polarizability: 185.7129955|-4.6030694|136.4114599|14.6362837|5.4272931|73.9894824 unknown
InChI: InChI=1S/C11H9NO3/c1-7(13)6-12-10(14)8-4-2-3-5-9(8)11(12)15/h2-5H,6H2,1H3
charge 0 multiplicity 1
24 atoms
O  -0.614308 2.282275 -0.297471
O  -0.44813 -2.412019 -0.613751
O  -4.455974 0.423642 0.088263
N  -0.868124 -0.071496 -0.526136
C  1.2841 0.681967 -0.048338
C  1.333937 -0.731466 -0.139233
C  -0.125745 1.12581 -0.291612
C  -0.041062 -1.236197 -0.447132
C  -2.293294 -0.105495 -0.844108
C  2.432121 1.438106 0.2303
C  2.533175 -1.435308 0.045463
C  -3.255445 0.156871 0.340652
C  3.651123 0.735305 0.418507
C  3.700899 -0.67887 0.327412
C  -2.708391 0.046634 1.751458
H  -2.527978 0.627982 -1.634706
H  -2.515963 -1.118121 -1.233349
H  2.382291 2.529329 0.297063
H  2.559907 -2.526902 -0.027859
H  4.568833 1.291596 0.636817
H  4.656154 -1.193089 0.476985
H  -3.538057 0.082077 2.473542
H  -2.131405 -0.88715 1.882774
H  -2.021168 0.890018 1.955257
