program: Gaussian 09
title: 000235045
version: EM64L-G09RevD.01
frameworkgroup: C1[X(C9H11NO4)]
method: RPBEPBE
basis: SDD
operation: Freq
keyword: #p
keyword: freq=noraman
keyword: PBEPBE/SDD
title: #p freq=noraman PBEPBE/SDD
converged: YES YES NO NO
title: Mulliken charges:
elementType: O O O O N C C C C C C C C C H H H H H H H H H H H
charge: -0.250170 -0.263497 -0.484910 -0.214750 -0.373569 0.015214 0.318526 0.172444 -0.365968 -0.791141 0.172853 0.109691 -0.255048 -0.667986 0.272619 0.354687 0.235228 0.212550 0.264346 0.230086 0.232418 0.215062 0.226746 0.247335 0.387232
chargesum: 0.00000
title: Mulliken charges with hydrogens summed into heavy atoms:
elementType: O O O O N C C C C C C C C C
charge: -0.250170 -0.263497 -0.097678 -0.214750 -0.018882 0.015214 0.318526 0.172444 -0.093350 -0.079017 0.172853 0.109691 0.207456 0.021158
polarizability: 1.44589722e+02 3.66966645e+00 1.52183928e+02 9.31616486e+00 1.73416762e+00 6.93731574e+01
1716.lowfreq: -7.3314 -4.4215 -2.3323 -0.0006 -0.0003 0.0004 27.1111 53.5718 57.1435
frequency: 26.8696 53.5603 57.1333 71.4057 87.0193 110.7120 123.6759 172.6057 211.6684 219.3425 268.5436 293.0799 309.9958 356.0506 389.9372 413.4306 472.7433 530.6098 552.1480 610.3627 620.7022 628.3841 697.8574 709.5555 722.9136 751.9171 764.9278 803.4424 816.6083 827.2707 918.0112 987.5253 1000.8388 1048.3388 1053.0558 1063.1505 1095.6314 1122.5221 1157.6694 1186.4092 1252.3508 1276.7484 1281.8277 1334.7200 1353.6778 1388.6622 1402.9142 1411.8384 1432.6968 1455.3220 1457.5866 1462.0828 1477.3033 1484.9594 1507.4969 1556.1414 1613.9216 1681.8262 2989.8094 2991.4992 3028.6056 3072.1000 3086.7208 3093.2738 3096.5538 3119.4217 3233.1717 3555.0533 3584.0281
redmass: 3.4439 6.4091 3.2180 5.1882 1.3297 2.8482 3.9156 3.8874 2.1885 1.8127 4.8255 3.9804 2.8611 5.1324 8.0992 4.3032 4.0027 1.2835 5.2054 3.8891 4.6091 3.7613 2.3687 1.6959 4.5887 3.7173 6.9350 1.3819 1.4297 3.6620 6.6786 1.7262 2.3981 1.4966 3.7951 2.9146 2.1277 1.6319 1.7029 1.7273 3.8007 1.1519 2.1063 3.5280 1.3467 1.2365 2.9639 1.5003 3.3813 1.1301 1.0467 1.0440 1.1810 1.0565 6.3142 4.5640 9.7494 9.0456 1.0376 1.0360 1.0597 1.0964 1.0973 1.1029 1.0999 1.1060 1.0990 1.0648 1.0816
irintensity: 1.1189 4.8362 1.3755 1.4224 0.5911 0.2750 1.7641 1.7119 2.5066 0.9420 1.7426 1.8590 12.0766 6.5794 2.2617 8.3394 5.3259 109.4969 9.4162 39.9026 27.5622 30.3220 18.3944 101.2333 15.2005 6.5178 7.5251 12.8279 3.5438 0.8020 319.3505 0.9695 3.2120 8.0155 232.2043 189.2870 13.3843 20.9391 27.0865 39.6658 173.8034 10.0534 44.8220 44.0221 0.2487 27.8327 75.0743 1.0402 44.9969 31.2933 13.9518 12.4214 22.2552 12.6349 112.0378 49.5103 143.1722 384.0304 26.7966 24.3513 26.6770 19.6946 38.7197 1.1197 14.4888 28.7288 0.8593 53.3615 126.3140
temp: 298.150 k
press: 1.00000 atm
elementType: 8 8 8 8 7 6 6 6 6 6 6 6 6 6 1 1 1 1 1 1 1 1 1 1 1
symmnumber: 1
zpe: 502371.4 jmol-1
zpe.correction: 0.191343 hartree
zpe.thermalcorrener: 0.205853 hartree
zpe.thermalcorrenthalpy: 0.206797 hartree
zpe.thermalcorrgfe: 0.148317 hartree
zpe.sumelectzpe: -704.177558 hartree
zpe.sumelectthermal: -704.163049 hartree
zpe.sumelectthermalent: -704.162104 hartree
zpe.sumelectthermalfe: -704.220585 hartree
dipole: 3.0129 0.1294 1.7204
dipole: 3.4719
quadrupole: -62.7242 -76.3276 -85.2154
quadrupole: 3.2619 -1.2719 1.7751
quadrupole: 12.0316 -1.5719 -10.4597 3.2619 -1.2719 1.7751
hfenergy: -704.3689012 hartree
pointgroup: C01 [X(C9H11N1O4)]
dipole: 1.0665354 0.5755835 0.6301398 debye
dipolederiv: -0.8871594 -0.3987715 0.1760821 -0.6287175 -0.8709539 0.3736963 0.3633142 0.4238108 -0.5889117 -0.8132112 0.0368634 -0.3200958 -0.1200605 -0.5098123 0.1677509 -0.0854572 0.2541131 -0.6739286 -1.3057601 0.330869 -0.3669833 0.1350991 -0.3492592 0.0481274 -0.3596393 0.1388332 -0.6129685 -0.568598 -0.1557541 -0.0955401 -0.0739953 -1.184827 0.0208273 -0.1161872 -0.003654 -0.3489169 -0.8253584 0.0076027 -0.1414021 -0.1005511 0.1703023 -0.0793894 -0.1950052 -0.0405955 -0.2298407 -0.4726843 -0.3408027 -0.0270378 -0.2626618 0.1405893 -0.0386803 -0.0752848 -0.1513545 -0.0676057 0.1669505 -0.4906883 0.1529524 0.0156167 -0.0382656 -0.0206041 -0.008932 -0.1383449 -0.0307633 0.2923128 0.3956715 -0.0305674 0.4800587 -0.9743822 0.2789934 0.0928878 0.2845819 -0.0526066 0.0450226 0.3410801 0.0097735 -0.0456544 -0.2107493 -0.019328 0.0976662 0.1128428 -0.1605404 -0.006324 0.1395753 -0.053349 0.0656726 0.0420205 0.0190435 -0.0428467 0.0250458 0.0216025 1.4216368 0.3306495 0.285174 0.7875418 1.0147486 -0.5374175 -0.137479 -0.6390704 0.9512908 1.4907203 -0.2435987 0.5219458 -0.3771992 1.9357002 -0.2477198 0.5387069 -0.2587383 0.5017298 0.7455976 0.3151324 -0.1592929 0.2442706 0.474013 -0.080629 -0.0854509 0.0213959 0.2681153 -0.133952 -0.0011853 0.0905481 0.0243867 -0.0390455 -0.0140657 0.0679801 -0.0588222 0.0124208 0.0546759 -0.0541087 -0.027781 -0.0605585 0.0201291 0.0237429 -0.0226009 0.017276 0.1946642 0.3110733 0.013803 -0.0092291 -0.0155672 0.239825 0.0202584 0.000351 0.0138428 0.3226535 -0.042286 0.0762602 0.0851245 0.0345979 0.0617365 0.0226265 0.1133376 -0.0167377 0.0035281 0.0226804 -0.14911 0.0198084 -0.0520698 -0.1266122 0.0505637 -0.0070373 0.0182996 0.109707 0.0741439 0.0309037 -0.0754801 0.003829 0.0792433 -0.06238 -0.0766803 -0.0012532 -0.0289682 -0.0164305 -0.0603918 0.0175161 -0.0100936 0.0701579 0.022535 -0.040607 -0.0797104 -0.0981872 -0.0067003 0.0470228 0.0123748 -0.003796 -0.1084003 0.046152 0.0034066 0.0678071 0.0817853 -0.1166219 -0.147463 0.019525 -0.1385355 0.0100302 -0.017029 0.0136742 -0.0073612 0.0950066 0.0800674 0.0153283 -0.0787738 0.026635 0.0971185 -0.0292619 -0.0181438 -0.028488 -0.1314208 0.1165019 0.0414824 -0.0004649 0.0788864 -0.0729947 0.0410763 -0.0231453 0.0744244 0.0602514 0.3737027 -0.0803699 -0.0048274 -0.007134 0.129688 0.011111 0.0031724 -0.0281433 0.4019035 unknown
polarizability: 141.1568038|5.3913159|148.3961066|13.9906909|-20.2782623|76.593897 unknown
InChI: InChI=1S/C9H11NO4/c1-3-14-9(13)6-5(2)4-10-7(6)8(11)12/h4,10-11H,3H2,1-2H3
charge 0 multiplicity 1
25 atoms
O  -1.620931 -0.922246 0.413437
O  -2.252379 0.496278 -1.330998
O  2.872079 -1.198498 0.997477
O  0.935717 -2.291677 0.285549
N  2.07948 1.178876 0.236288
C  -0.082245 0.752208 -0.274556
C  0.172998 2.152277 -0.507768
C  1.127765 0.159021 0.180709
C  1.521186 2.375979 -0.171935
C  -0.803497 3.191772 -0.990399
C  -1.40349 0.120394 -0.478638
C  1.541839 -1.21411 0.467363
C  -2.877657 -1.709589 0.238714
C  -4.021168 -1.09086 1.048313
H  2.097104 3.29821 -0.204972
H  3.042026 1.004314 0.526948
H  -1.642783 3.317885 -0.281792
H  -0.308782 4.170785 -1.112856
H  -1.251805 2.893386 -1.953028
H  -3.122992 -1.747363 -0.837271
H  -2.602297 -2.711841 0.603404
H  -4.915359 -1.738881 0.986261
H  -3.740439 -0.991176 2.11111
H  -4.286362 -0.096304 0.652457
H  3.153193 -2.13744 1.156081
