program: Gaussian 09
title: 000235028
version: EM64L-G09RevD.01
frameworkgroup: C1[X(C13H8Cl2OS)]
method: RPBEPBE
basis: SDD
operation: Freq
keyword: #p
keyword: freq=noraman
keyword: PBEPBE/SDD
title: #p freq=noraman PBEPBE/SDD
converged: YES YES NO NO
title: Mulliken charges:
elementType: Cl Cl S O C C C C C C C C C C C C C H H H H H H H H
charge: -0.031548 -0.051348 0.137496 -0.153299 0.421445 -0.139418 -0.339865 -0.287632 -0.247482 -0.158697 -0.240649 -0.208369 -0.208842 -0.098869 -0.209225 -0.196422 -0.094815 0.280866 0.256062 0.265372 0.257600 0.264561 0.263046 0.259931 0.260101
chargesum: 0.00000
title: Mulliken charges with hydrogens summed into heavy atoms:
elementType: Cl Cl S O C C C C C C C C C C C C C
charge: -0.031548 -0.051348 0.137496 -0.153299 0.421445 -0.139418 -0.058999 -0.031570 -0.247482 0.106675 0.016952 0.056192 0.054205 -0.098869 0.050706 0.063679 -0.094815
polarizability: 3.54746753e+02 -4.25743945e+00 1.49151196e+02 -5.11738363e+00 -4.58141403e+00 8.51981514e+01
1716.lowfreq: -2.0570 -0.0021 -0.0019 -0.0018 3.4659 7.5257 17.9309 24.8716 34.6178
frequency: 17.8162 24.8477 34.5847 50.2265 90.0805 103.9316 128.3673 192.7681 223.2775 255.1349 287.6525 305.2441 321.1666 330.2908 382.1386 403.3203 407.3863 448.1873 464.9978 486.6376 516.2619 558.9902 618.9858 619.7591 622.2671 695.9036 702.3271 716.4304 721.5725 818.0934 821.4808 829.7146 848.1993 862.6632 945.3415 959.7163 962.9233 986.2895 990.9961 1000.2696 1068.9747 1072.6804 1074.6816 1104.7698 1116.6249 1182.5915 1186.0752 1205.8074 1287.2316 1298.1690 1362.2309 1371.5955 1381.5688 1400.7033 1457.8088 1472.7463 1571.0263 1576.2662 1580.7067 1594.4391 1620.6175 3152.1285 3153.4286 3159.1854 3165.0177 3176.4435 3177.2339 3180.3689 3185.0025
redmass: 10.7046 5.1763 8.4140 6.9434 10.7169 10.6870 10.4713 10.9370 11.8410 7.4336 6.9849 8.8582 5.8069 10.9872 9.2568 2.8835 2.8940 8.7217 3.6586 3.7027 8.9049 8.1785 6.1301 5.7738 7.2465 4.0390 7.7467 7.2924 3.8038 1.3641 1.3225 1.3130 1.4718 7.4922 1.3315 1.3739 1.3650 1.3597 5.7153 3.9539 7.2452 2.1838 2.4562 1.3650 1.3469 1.1646 1.2448 2.8043 1.2358 1.2559 4.6731 5.0580 4.1070 4.1284 2.1705 2.3036 7.9322 6.3592 7.8625 6.1371 11.7536 1.0895 1.0894 1.0890 1.0891 1.0969 1.0961 1.0975 1.0978
irintensity: 0.0234 0.0316 0.0512 0.3448 1.4381 0.5321 2.1055 1.7731 8.1850 0.5447 0.0943 0.8707 4.5364 16.4676 15.1087 0.0128 0.0659 2.0340 11.8964 21.4545 49.8680 34.4140 8.6087 11.1491 2.1771 1.0475 22.5332 5.6211 6.2762 40.9921 43.9521 10.2306 51.6741 335.0638 0.4622 0.6613 0.1036 0.7924 90.1282 26.6839 8.6833 121.5285 11.4290 8.5512 12.2430 43.9091 73.2431 158.1237 1.6048 1.7901 1.8070 9.5238 10.0673 13.7793 92.3608 44.2175 38.4063 8.7289 3.0690 117.1932 120.9560 3.5332 1.8518 0.0860 1.8901 3.9938 2.3455 2.1577 0.9360
temp: 298.150 k
press: 1.00000 atm
elementType: 17 17 16 8 6 6 6 6 6 6 6 6 6 6 6 6 6 1 1 1 1 1 1 1 1
symmnumber: 1
zpe: 443170.8 jmol-1
zpe.correction: 0.168795 hartree
zpe.thermalcorrener: 0.184311 hartree
zpe.thermalcorrenthalpy: 0.185256 hartree
zpe.thermalcorrgfe: 0.122214 hartree
zpe.sumelectzpe: -1892.412861 hartree
zpe.sumelectthermal: -1892.397345 hartree
zpe.sumelectthermalent: -1892.396401 hartree
zpe.sumelectthermalfe: -1892.459443 hartree
dipole: -1.7794 1.1159 0.2761
dipole: 2.1184
quadrupole: -130.0501 -111.6501 -119.3368
quadrupole: 3.7712 -0.1912 -3.9795
quadrupole: -9.7044 8.6956 1.0088 3.7712 -0.1912 -3.9795
hfenergy: -1892.5816562 hartree
pointgroup: C01 [X(C13H8Cl2O1S1)]
dipole: 0.6812772 0.2726307 0.3951952 debye
dipolederiv: -1.0714534 -0.0083747 -0.0724505 -0.0183586 -0.0727111 -0.027801 -0.0959286 -0.0273489 -0.0981908 -0.9479325 -0.1256489 -0.1559384 -0.17587 -0.0974074 -0.0173197 -0.2122745 -0.0134519 -0.1586221 -0.7633799 0.1482658 0.1886252 0.4351823 -0.2028238 -0.1408791 0.6874002 -0.124509 -0.2610131 -0.7770298 -0.1179816 -0.1594402 0.1545794 -0.4978262 -0.3488514 0.1684229 -0.3967296 -0.7209015 -0.9693718 0.0014947 -0.0497255 0.0818197 -0.0396407 -0.0427556 0.1552815 -0.0592703 -0.0693759 0.7840247 0.0490732 0.0388724 0.1294968 -0.0673053 -0.0360247 0.2259646 -0.061898 -0.0683484 0.2304323 0.0582132 0.1041911 -0.1864638 -0.0431602 0.0607858 -0.2372981 0.0731793 0.0011013 0.1928267 -0.0352685 -0.0307664 0.1050952 -0.0639324 0.0541429 0.1772208 0.0487751 -0.0222352 2.1114712 -0.1174346 -0.0568364 -0.6222536 0.5400408 0.519444 -0.9846083 0.5879719 0.8103539 -0.1157211 0.050623 -0.0905195 -0.1526948 -0.0637079 -0.0220678 -0.0045325 -0.0354322 0.018367 -0.1833341 0.0155772 0.091869 0.0608164 -0.081068 -0.018016 -0.1822063 -0.0416312 0.0432848 -0.5204191 -0.1011661 -0.1681844 -0.1395293 -0.0787227 0.0270896 -0.2493745 0.0289466 -0.0752369 -0.5553735 0.0740998 0.0814828 0.1571389 -0.0708997 0.0552907 0.1719929 0.0529338 -0.0184863 1.5345739 0.0115152 0.1163691 0.030703 0.0354621 0.1252662 0.1608616 0.1245613 0.1362564 -0.3910673 -0.0487007 0.0410224 -0.0718234 -0.1060634 -0.0050958 -0.0227289 -0.032266 0.0171715 -0.3295962 0.0064619 -0.1488811 0.0017628 -0.0949471 -0.0481379 -0.11397 -0.0369723 -0.0718923 1.3105608 0.2295413 0.2617915 0.2819244 0.0004579 -0.0041388 0.2958598 0.0020686 0.1979452 0.1209679 -0.0406912 -0.0636922 -0.0216418 0.1161278 -0.0559239 -0.0265355 -0.0593307 0.067439 0.0714167 0.0539048 0.067094 0.0627594 0.1130679 -0.0534901 0.0999555 -0.0536767 0.0760994 0.0472743 -0.0575628 0.0630194 -0.0493226 0.1108685 0.0155172 0.0729612 0.0355421 0.047944 0.1020598 -0.0131799 -0.0774465 -0.0089586 0.1374031 0.0284127 -0.0707942 0.0457317 -0.0096178 0.0159407 0.0437804 0.0525301 0.041487 0.1164269 -0.068195 0.0460155 -0.0681201 0.0714167 0.0483699 -0.0252684 -0.0428507 -0.0305131 0.1127184 -0.0767435 -0.0514132 -0.0774005 0.0510011 0.0473285 -0.0037555 -0.0496146 -0.0098494 0.1548705 0.0317119 -0.0585756 0.0400851 -0.0074598 0.0074311 -0.0475175 0.0594793 -0.0554864 0.1427722 0.0477794 0.048304 0.0482419 0.0429999 unknown
polarizability: 354.0586347|8.4967753|91.1278333|10.5578181|19.2556742|143.9096325 unknown
InChI: InChI=1S/C13H8Cl2OS/c14-10-3-1-9(2-4-10)13(16)17-12-7-5-11(15)6-8-12/h1-8H
charge 0 multiplicity 1
25 atoms
Cl 6.64904 0.025047 0.35307
Cl -6.556672 -0.441823 -0.683005
S  -0.443488 0.828611 0.956315
O  0.030106 -0.765876 -1.253765
C  2.045468 -0.06543 -0.103328
C  -2.159587 0.424841 0.437112
C  2.873841 -0.75485 -1.032262
C  2.646159 0.651132 0.965731
C  0.570406 -0.139773 -0.316945
C  -2.609743 0.675741 -0.87898
C  -3.043608 -0.09051 1.412917
C  4.275198 -0.732739 -0.899862
C  4.047696 0.682909 1.107469
C  4.841731 -0.011023 0.171344
C  -3.95193 0.404727 -1.225505
C  -4.392056 -0.350432 1.07798
C  -4.821912 -0.100336 -0.239459
H  2.401342 -1.30463 -1.852229
H  2.028951 1.186309 1.694493
H  -1.925307 1.069571 -1.634276
H  -2.686723 -0.293557 2.427332
H  4.914811 -1.26243 -1.611167
H  4.515001 1.233747 1.928126
H  -4.30998 0.587726 -2.242252
H  -5.084845 -0.745554 1.826044
