program: Gaussian 09
title: 000235027
version: EM64L-G09RevD.01
frameworkgroup: C1[X(C8H10O3S2)]
method: RPBEPBE
basis: SDD
operation: Freq
keyword: #p
keyword: freq=noraman
keyword: PBEPBE/SDD
title: #p freq=noraman PBEPBE/SDD
converged: YES YES NO NO
title: Mulliken charges:
elementType: S S O O O C C C C C C C C H H H H H H H H H H
charge: 0.826185 0.017987 -0.489327 -0.510300 -0.433670 -0.063546 -0.703082 -0.219853 -0.236925 -0.258305 -0.205018 -0.198011 -0.212148 0.299218 0.309255 0.277014 0.290638 0.199761 0.232625 0.247559 0.247845 0.243363 0.338735
chargesum: 0.00000
title: Mulliken charges with hydrogens summed into heavy atoms:
elementType: S S O O O C C C C C C C C
charge: 0.826185 0.017987 -0.489327 -0.510300 -0.094935 -0.063546 -0.094608 0.057160 0.053712 0.174081 0.042541 0.049834 0.031215
polarizability: 1.89685721e+02 1.02859967e+00 1.34449142e+02 -7.65053580e+00 1.11918502e+01 1.14017450e+02
1716.lowfreq: -13.0099 -8.9836 -0.0012 -0.0010 -0.0002 3.6277 19.5643 32.9066 41.6596
frequency: 18.4673 32.4956 41.5981 68.6807 106.6397 143.9675 166.3261 176.3214 187.2447 243.5177 246.6458 284.6228 342.0713 376.7810 402.6372 404.7494 439.9590 444.5782 495.3289 599.3665 605.7470 652.1239 685.4264 758.1645 795.6265 797.8685 842.6249 914.4951 930.2217 930.4206 972.9848 982.0864 1001.7404 1006.0773 1006.7303 1040.0098 1042.0644 1077.6987 1147.3248 1174.6121 1178.3451 1198.8994 1283.1754 1301.9459 1320.8815 1371.2535 1382.8804 1393.8141 1436.5836 1449.4135 1460.5364 1572.1074 1602.3107 2965.8415 2988.1427 3065.9549 3079.0514 3141.5931 3150.8478 3159.0217 3168.2214 3177.8888 3496.2337
redmass: 4.4522 5.7665 4.2865 8.9771 3.9466 5.8641 5.9510 5.9747 7.1870 10.9867 8.5633 2.5726 6.5990 9.5006 2.5890 2.3191 2.1902 2.3429 4.4326 6.4851 4.3408 6.9793 2.5161 1.3833 16.9934 2.0568 1.2453 2.3359 3.4536 1.9045 6.3844 1.3882 1.7058 2.1920 1.9429 3.0615 2.0777 1.5425 1.1208 1.0565 1.1215 1.2214 1.2206 1.3036 1.2091 1.2037 8.2621 1.0973 2.2501 2.0096 1.0861 5.7963 6.9432 1.0667 1.0613 1.0955 1.1010 1.0860 1.0884 1.0927 1.0970 1.1017 1.0653
irintensity: 1.0270 2.4909 0.7560 0.4656 5.4478 1.4884 5.5362 1.2099 3.3842 0.4500 8.4571 2.2350 0.7212 35.5421 7.6442 26.7725 84.6859 80.6033 91.4983 0.0121 12.8787 1.9564 27.3228 73.5636 60.3780 8.1080 0.7475 63.1692 37.3225 15.2235 6.2012 0.0369 4.2203 0.1889 1.5181 55.0166 20.7116 6.0302 24.2058 0.1316 7.8978 23.7128 8.0934 3.3070 18.1599 43.8885 6.4680 40.6575 15.0233 16.7163 6.1668 5.0702 0.8671 48.5386 2.1066 21.3713 7.0058 1.0775 7.7409 1.2096 2.2439 22.4033 1.5909
temp: 298.150 k
press: 1.00000 atm
elementType: 16 16 8 8 8 6 6 6 6 6 6 6 6 1 1 1 1 1 1 1 1 1 1
symmnumber: 1
zpe: 436224.2 jmol-1
zpe.correction: 0.166149 hartree
zpe.thermalcorrener: 0.180555 hartree
zpe.thermalcorrenthalpy: 0.181499 hartree
zpe.thermalcorrgfe: 0.122232 hartree
zpe.sumelectzpe: -1331.489668 hartree
zpe.sumelectthermal: -1331.475262 hartree
zpe.sumelectthermalent: -1331.474317 hartree
zpe.sumelectthermalfe: -1331.533585 hartree
dipole: 3.7806 3.1087 -0.5364
dipole: 4.9238
quadrupole: -79.7162 -105.2288 -93.4512
quadrupole: 10.8632 -6.7699 6.0362
quadrupole: 13.0825 -12.4300 -0.6525 10.8632 -6.7699 6.0362
hfenergy: -1331.6558167 hartree
pointgroup: C01 [X(C8H10O3S2)]
dipole: -1.4519771 -1.0002404 0.8024857 debye
dipolederiv: 1.729338 -0.1271257 -0.05977 -0.2529813 1.244273 -0.1676693 -0.1927675 -0.1253418 0.9308576 -0.3628468 0.0723026 -0.0512911 0.25896 -0.3744518 -0.0056731 0.0458076 0.0708259 -0.2558729 -0.681028 0.0517436 -0.0352266 0.0095954 -0.4956537 0.1080326 -0.0826744 0.1782139 -0.5424649 -0.6101898 -0.0269587 0.0155253 0.0232229 -0.6083152 -0.0097861 0.1385565 -0.1328348 -0.4818956 -0.343359 0.0281936 0.1478686 0.1687367 -0.7085907 0.1402239 0.0614662 0.1515934 -0.4658497 0.0876947 0.0832167 -0.051286 0.2013014 -0.1382959 0.0005906 -0.0774676 0.0029361 -0.024587 -0.0097329 0.0100891 0.1006298 0.0149005 -0.0882129 0.0483463 0.2516956 0.0076889 0.155657 -0.2805373 -0.034766 0.1596953 -0.0448543 -0.0803913 0.0935554 -0.0997384 -0.064406 -0.0686515 -0.2078618 -0.0035015 -0.0554264 -0.0514766 -0.0866506 -0.0768248 0.2737807 0.0878618 -0.0788403 0.2592926 0.0015098 -0.0720117 -0.2174208 0.5326314 -0.0656963 -0.0223788 -0.0126295 0.2292242 -0.0795848 0.0232415 -0.0691718 0.0086327 -0.1090997 -0.055624 0.0380897 0.000391 0.1297859 0.0209779 0.0853832 0.1431789 0.0586215 -0.0758312 0.0879359 0.0274338 0.0218285 -0.0067956 0.0407175 0.1253735 -0.0473164 0.1105393 -0.0442233 -0.0405793 -0.0409763 -0.0398768 0.0112161 -0.0399025 -0.015529 0.0265401 0.0146037 0.1401711 -0.0204693 -0.0788002 0.0089318 0.0210696 0.1533974 0.0501674 -0.0044122 0.0282869 -0.0143197 0.0306196 -0.1264715 0.0387315 0.0307731 0.1007537 -0.049391 -0.0658927 -0.0298546 0.11634 -0.0361861 -0.0628112 -0.0061876 0.1057162 0.1636016 -0.0199535 0.0320663 0.0311234 0.1422131 0.0328587 0.0060816 0.0066965 0.0476048 -0.1404791 0.0720779 0.1183888 0.0644555 -0.0423802 -0.0172606 0.0892419 -0.0018113 0.0390468 -0.0124984 -0.0605273 -0.1034391 -0.0018329 0.017481 -0.0064412 -0.137712 -0.0439691 -0.0306888 0.0769862 -0.0425658 0.0152831 -0.0646019 0.1277312 0.0282093 0.0331683 0.0224552 -0.072463 -0.0017172 -0.0855989 -0.0603658 -0.1092232 0.1068529 -0.0249797 -0.0558015 -0.0287734 0.0259342 -0.0129553 -0.1016106 0.0574012 -0.0973064 0.093664 0.0381893 0.0602787 0.0406681 0.0707442 0.1499333 -0.0357707 -0.1409674 -0.1234279 0.3450584 -0.0813719 -0.0480012 -0.1829922 0.2304797 unknown
polarizability: 188.6571584|10.6916107|111.8953123|5.1675832|-7.0386814|137.5998421 unknown
InChI: InChI=1S/C6H5O2S.C2H5OS/c7-9(8)6-4-2-1-3-5-6;3-1-2-4/h1-5H;3H,1-2H2
charge 0 multiplicity 1
23 atoms
S  0.401691 1.219849 -1.144704
S  2.240634 -0.419134 -1.461823
O  -0.078175 1.760266 -2.601628
O  0.949345 2.244834 0.00947
O  3.44193 -1.751269 1.18423
C  -1.026692 0.227844 -0.40196
C  3.359057 0.356651 -0.151984
C  -1.087344 0.102101 0.99473
C  -1.972581 -0.308073 -1.28986
C  3.188756 -0.310544 1.220137
C  -2.174905 -0.623467 1.533223
C  -3.050174 -1.031795 -0.727449
C  -3.145985 -1.191792 0.674915
H  4.381965 0.229747 -0.548194
H  3.11486 1.436715 -0.110925
H  -0.335398 0.573005 1.636015
H  -1.883128 -0.149288 -2.369073
H  2.177341 -0.087118 1.620709
H  3.937963 0.093874 1.922663
H  -2.261248 -0.739059 2.618335
H  -3.810754 -1.463812 -1.385604
H  -3.983725 -1.753882 1.100844
H  2.81987 -2.15085 0.518634
