program: Gaussian 09
title: 000235025
version: EM64L-G09RevD.01
frameworkgroup: C1[X(C11H14N2O4)]
method: RPBEPBE
basis: SDD
operation: Freq
keyword: #p
keyword: freq=noraman
keyword: PBEPBE/SDD
title: #p freq=noraman PBEPBE/SDD
converged: YES YES NO NO
title: Mulliken charges:
elementType: O O O O N N C C C C C C C C C C C H H H H H H H H H H H H H H
charge: -0.205691 -0.193429 -0.304402 -0.286855 -0.166846 -0.372746 -0.254712 -0.250161 -0.485744 -0.486695 0.173626 0.172240 -0.190261 -0.189769 -0.261277 0.345913 -0.605148 0.284122 0.284239 0.228002 0.244377 0.244668 0.227319 0.228328 0.228196 0.280767 0.249750 0.328729 0.229467 0.231455 0.272538
chargesum: 0.00000
title: Mulliken charges with hydrogens summed into heavy atoms:
elementType: O O O O N N C C C C C C C C C C C
charge: -0.205691 -0.193429 -0.304402 -0.286855 -0.166846 -0.044018 0.029410 0.034078 -0.013366 -0.014707 0.173626 0.172240 0.038068 0.038427 0.269240 0.345913 0.128312
polarizability: 1.64031815e+02 -8.20057011e+00 1.35913294e+02 8.30753616e+00 -8.23337948e+00 1.13876365e+02
1716.lowfreq: -11.8864 -7.2518 -0.0007 -0.0007 -0.0003 3.9072 17.0854 26.7444 36.5411
frequency: 15.7290 26.5621 36.4874 44.1200 83.4440 103.0983 127.4181 140.3173 163.4021 179.1793 204.0874 236.4710 254.7130 301.2055 349.0784 355.0822 377.2648 441.5906 449.2685 518.8905 560.3191 577.3087 584.6751 620.2671 622.9962 676.3276 691.5800 694.5662 720.3128 745.5912 769.8206 847.1338 856.6198 929.4495 935.7792 944.9117 947.4446 959.2221 965.4536 1039.0860 1051.3045 1066.5939 1084.6963 1110.2587 1114.4894 1126.4864 1146.7506 1150.3083 1188.3542 1197.8757 1199.9616 1201.9698 1217.8445 1263.3737 1285.8769 1291.2410 1306.7916 1309.8742 1314.3574 1337.3503 1362.2590 1384.1398 1431.3102 1453.5843 1463.1019 1463.9040 1473.8444 1484.7840 1518.1420 1635.1861 1651.7763 1694.9615 1700.1605 2966.7428 2971.8037 2981.9505 3016.1553 3032.5593 3037.2754 3060.2986 3072.6117 3075.0722 3113.6744 3115.0797 3121.8553 3153.4395 3578.8256
redmass: 3.7345 4.7640 5.2739 5.4183 4.6289 1.1875 4.7151 2.6890 4.6882 4.7607 4.8773 4.0736 3.5851 3.6199 4.9419 5.8466 2.9043 4.2288 3.4837 4.8570 4.0371 1.1188 10.7072 4.8162 5.0089 2.0110 10.4953 2.5099 2.6849 4.0450 4.5900 3.4678 3.8190 1.9501 2.3022 5.8655 2.3667 2.6624 1.6752 2.5519 2.1606 5.9960 5.0006 2.2877 2.4807 1.2859 1.6525 1.1897 2.0943 1.3733 1.5089 1.7853 1.3903 1.3789 1.2242 1.1968 1.4979 1.4842 1.5966 4.4635 1.6668 1.2996 1.1598 1.1114 1.0966 1.2382 1.0874 1.0440 1.4525 12.4763 6.5968 9.9268 10.1742 1.0686 1.0687 1.0353 1.0831 1.0842 1.0561 1.1028 1.0934 1.0938 1.1099 1.0985 1.0857 1.1022 1.0773
irintensity: 0.8607 0.1733 0.8820 5.5379 5.9390 0.6818 4.9510 2.6285 1.8047 0.7459 0.1330 3.2069 7.7948 7.1454 34.3094 4.7404 3.1502 23.0388 1.3700 0.7300 4.8769 131.4669 7.7045 11.2819 5.3885 42.5206 19.4574 0.4412 28.0881 12.0182 18.9255 3.5852 37.6826 10.1305 6.9112 213.7309 38.0300 8.4824 0.5597 10.2142 14.3638 89.0139 257.0371 10.9753 14.8743 0.3412 23.4484 0.7162 54.3880 84.8096 41.4433 191.1502 7.6418 0.2164 0.4074 7.5258 38.3316 11.4634 4.4749 232.3667 0.6595 17.4104 29.7881 58.6578 2.3344 93.0836 12.6902 15.6077 146.0093 495.4249 9.2809 125.0508 195.5392 24.0917 9.5740 74.8399 0.9119 10.1344 17.1869 35.9721 25.9652 7.2771 7.6387 3.5200 6.0835 42.7451 33.7172
temp: 298.150 k
press: 1.00000 atm
elementType: 8 8 8 8 7 7 6 6 6 6 6 6 6 6 6 6 6 1 1 1 1 1 1 1 1 1 1 1 1 1 1
symmnumber: 1
zpe: 640459.9 jmol-1
zpe.correction: 0.243938 hartree
zpe.thermalcorrener: 0.260403 hartree
zpe.thermalcorrenthalpy: 0.261347 hartree
zpe.thermalcorrgfe: 0.196813 hartree
zpe.sumelectzpe: -836.713966 hartree
zpe.sumelectthermal: -836.697501 hartree
zpe.sumelectthermalent: -836.696557 hartree
zpe.sumelectthermalfe: -836.761091 hartree
dipole: -2.2651 -1.9812 -2.6486
dipole: 4.0089
quadrupole: -85.8128 -104.8135 -99.2434
quadrupole: -1.2232 -14.4245 8.8472
quadrupole: 10.8104 -8.1903 -2.6202 -1.2232 -14.4245 8.8472
hfenergy: -836.9579038 hartree
pointgroup: C01 [X(C11H14N2O4)]
dipole: 0.8579095 1.0977675 0.7392538 debye
polarizability: 163.5534045|9.4650793|113.7701959|-8.2512647|-7.5633045|136.4978736 unknown
InChI: InChI=1S/C11H14N2O4/c1-12-11(16)17-6-13-9(14)7-4-2-3-5-8(7)10(13)15/h2-3,7-8,12H,4-6H2,1H3
charge 0 multiplicity 1
31 atoms
O  0.948045 0.442423 -2.737445
O  -0.284745 -1.696972 1.250481
O  -2.095803 0.375966 -0.690492
O  -3.834003 -1.153019 -0.171476
N  0.042811 -0.658664 -0.848665
N  -3.864445 1.091143 0.540187
C  2.375208 -0.132699 -0.762415
C  1.966626 -0.845203 0.561292
C  3.013252 1.280144 -0.561939
C  2.270344 -0.02265 1.855068
C  1.092425 -0.055903 -1.597605
C  0.468939 -1.14234 0.420026
C  3.99065 1.256963 0.599624
C  3.635604 0.634006 1.754856
C  -1.331583 -0.724021 -1.31306
C  -3.334449 -0.004329 -0.092766
C  -5.153958 1.039663 1.234184
H  3.105196 -0.74944 -1.317601
H  2.495716 -1.811343 0.650996
H  2.205424 2.012067 -0.351843
H  3.489668 1.603926 -1.501993
H  2.187692 -0.681146 2.735458
H  1.49121 0.759061 1.974423
H  4.960666 1.756389 0.492649
H  4.306509 0.608357 2.621498
H  -1.797459 -1.683171 -1.029189
H  -1.329443 -0.563288 -2.402783
H  -3.322326 1.954829 0.515502
H  -5.877369 1.74793 0.789742
H  -5.039012 1.269861 2.309343
H  -5.552889 0.01786 1.135043
