program: Gaussian 09
title: 000235024
version: EM64L-G09RevD.01
frameworkgroup: C1[X(C14H18)]
method: RPBEPBE
basis: SDD
operation: Freq
keyword: #p
keyword: freq=noraman
keyword: PBEPBE/SDD
title: #p freq=noraman PBEPBE/SDD
converged: YES YES NO NO
title: Mulliken charges:
elementType: C C C C C C C C C C C C C C H H H H H H H H H H H H H H H H H H
charge: -0.410161 -0.410161 -0.411274 -0.411273 -0.522980 -0.522980 -0.431917 -0.431917 0.351228 0.351228 -0.374970 -0.374970 -0.128597 -0.128596 0.205947 0.205734 0.205946 0.205734 0.204885 0.206887 0.204885 0.206887 0.227661 0.219763 0.227661 0.219762 0.215769 0.213405 0.215770 0.213404 0.228620 0.228620
chargesum: 0.00000
title: Mulliken charges with hydrogens summed into heavy atoms:
elementType: C C C C C C C C C C C C C C
charge: 0.001519 0.001519 0.000499 0.000499 -0.075556 -0.075556 -0.002743 -0.002743 0.351228 0.351228 -0.146350 -0.146350 -0.128597 -0.128596
polarizability: 2.76516213e+02 -1.87577671e-05 1.37708829e+02 4.85881068e-01 -4.89014702e-06 9.55686657e+01
1716.lowfreq: -16.3791 -3.0780 -0.0007 0.0003 0.0004 7.0823 15.4713 42.2634 43.8823
frequency: 15.3738 42.1948 43.7971 93.5479 133.6487 146.4234 196.8127 226.4665 250.7295 288.9325 321.7173 381.6606 428.0330 443.3458 448.8676 477.6581 514.0020 534.5521 534.9468 544.2199 639.3636 732.1480 773.5866 799.0317 800.6810 840.4498 846.6547 850.2590 867.4735 916.2847 916.3497 923.0188 923.8231 947.8861 968.9239 1050.1235 1066.4248 1075.4924 1076.6033 1088.4726 1101.8610 1106.6969 1130.2785 1130.8390 1169.1159 1169.6499 1236.3311 1236.3549 1248.8809 1261.7407 1289.1584 1304.8455 1307.5008 1333.1069 1334.5358 1336.1548 1342.8309 1345.9005 1346.8931 1354.6411 1362.6156 1451.2292 1452.1033 1458.4231 1458.8166 1469.9601 1469.9809 1474.8915 1475.1115 1622.5288 1646.2538 2212.8601 2941.8242 2941.9563 2967.9201 2968.3269 2978.7469 2978.8274 2979.6993 2979.8219 3000.3360 3000.4122 3026.9202 3026.9541 3039.7045 3039.9923 3049.2147 3049.3390 3115.0095 3115.1821
redmass: 2.9014 4.1584 3.7704 2.6636 4.5953 2.1863 2.1618 4.3169 2.3718 1.9722 1.8684 2.5728 3.1518 4.0993 3.0812 3.0667 3.5754 5.7920 3.2753 3.7813 2.3480 2.4060 3.4382 1.2997 1.3181 2.5040 1.6484 1.6223 2.1193 1.4499 1.4465 2.2677 2.2999 2.6826 2.7268 2.7925 1.7448 1.7999 1.8243 1.8135 1.4629 1.6410 1.1594 1.1600 1.5384 1.5443 1.3085 1.3108 1.4606 1.1860 1.8538 1.2637 1.2622 1.7581 1.4239 1.4715 1.6574 1.5634 1.5325 1.5617 2.4643 1.1037 1.0985 1.0812 1.0809 1.0846 1.0851 1.0933 1.0939 6.1005 6.6621 11.9786 1.0653 1.0653 1.0633 1.0635 1.0669 1.0667 1.0624 1.0629 1.0884 1.0883 1.0956 1.0954 1.0993 1.0991 1.1042 1.1042 1.0910 1.0909
irintensity: 0.0091 0.8737 1.2013 0.0826 0.7774 3.3876 0.3726 0.0021 0.1452 0.0340 1.1765 0.0109 2.2392 1.5499 3.6859 2.0647 6.0292 8.5182 0.0110 0.0000 14.4516 0.0621 3.3195 1.5985 19.4796 0.3302 24.3429 0.8455 6.8755 7.4113 0.1256 1.9092 18.7950 3.9763 4.2069 0.0010 8.6042 1.9187 0.9370 6.7082 3.9272 0.2558 1.9376 6.8978 1.5212 0.0288 8.5016 0.2425 2.7328 3.2332 2.6318 0.0304 0.3733 0.7384 5.9243 2.6284 5.4653 17.5627 1.8343 0.0318 20.4553 4.5926 0.5825 17.6589 18.9744 0.0018 21.8491 12.1980 3.9691 3.6163 2.1678 0.4066 50.4909 42.6952 19.6166 24.3246 50.4397 5.8162 42.0878 26.4015 98.2401 21.6339 13.9614 30.5786 125.7137 27.7564 16.9871 125.5760 15.0460 23.6398
temp: 298.150 k
press: 1.00000 atm
elementType: 6 6 6 6 6 6 6 6 6 6 6 6 6 6 1 1 1 1 1 1 1 1 1 1 1 1 1 1 1 1 1 1
symmnumber: 1
zpe: 729795.4 jmol-1
zpe.correction: 0.277964 hartree
zpe.thermalcorrener: 0.291583 hartree
zpe.thermalcorrenthalpy: 0.292527 hartree
zpe.thermalcorrgfe: 0.235690 hartree
zpe.sumelectzpe: -543.171379 hartree
zpe.sumelectthermal: -543.157760 hartree
zpe.sumelectthermalent: -543.156816 hartree
zpe.sumelectthermalfe: -543.213653 hartree
dipole: 0.0000 -0.3553 0.0000
dipole: 0.3553
quadrupole: -70.1789 -80.6594 -86.6155
quadrupole: 0.0000 0.1185 0.0000
quadrupole: 8.9724 -1.5081 -7.4642 0.0000 0.1185 0.0000
hfenergy: -543.449343 hartree
pointgroup: C01 [X(C14H18)]
dipole: 0.0000011 -0.1398007 0.0000004 debye
polarizability: 276.5158606|0.0006604|137.7088293|0.5475946|0.0002429|95.5690182 unknown
InChI: InChI=1S/C14H18/c1-3-7-13(8-4-1)11-12-14-9-5-2-6-10-14/h7,9H,1-6,8,10H2
charge 0 multiplicity 1
32 atoms
C  4.176405 -1.230072 0.418177
C  -4.176388 -1.230109 -0.418658
C  4.921556 -0.122406 -0.360188
C  -4.921548 -0.122458 0.359721
C  2.681412 -1.263355 0.028388
C  -2.681394 -1.263381 -0.028873
C  4.337586 1.268205 -0.01601
C  -4.337593 1.268162 0.015558
C  2.052079 0.135026 0.015594
C  -2.052074 0.135006 -0.016063
C  2.822892 1.271982 0.010064
C  -2.822899 1.271955 -0.010519
C  0.621767 0.195312 0.004504
C  -0.621763 0.195306 -0.004973
H  4.270116 -1.033459 1.505132
H  4.63648 -2.217951 0.225589
H  -4.270103 -1.033484 -1.505611
H  -4.636453 -2.217994 -0.22608
H  4.81294 -0.30812 -1.447354
H  6.004056 -0.145408 -0.132603
H  -4.812928 -0.308183 1.446885
H  -6.004049 -0.145468 0.132138
H  2.114056 -1.907738 0.726751
H  2.560035 -1.719181 -0.975994
H  -2.114033 -1.90775 -0.727244
H  -2.560011 -1.719218 0.975504
H  4.695149 2.026124 -0.742404
H  4.719743 1.603561 0.97336
H  -4.695162 2.026069 0.74196
H  -4.719755 1.603525 -0.973808
H  2.319222 2.248012 0.024883
H  -2.319239 2.24799 -0.025327
