program: Gaussian 09
title: 000234984
version: EM64L-G09RevD.01
frameworkgroup: C1[X(C12H17N5O3S)]
method: RPBEPBE
basis: SDD
operation: Freq
keyword: #p
keyword: freq=noraman
keyword: PBEPBE/SDD
title: #p freq=noraman PBEPBE/SDD
converged: YES YES NO NO
title: Mulliken charges:
elementType: S O O O N N N N N C C C C C C C C C C C C H H H H H H H H H H H H H H H H H
charge: 0.163873 -0.312352 -0.446990 -0.433768 -0.190881 -0.083528 -0.178969 -0.061316 -0.604271 -0.593412 -0.039475 -0.057701 -0.064270 -0.327289 0.237520 -0.197608 -0.570971 -0.101979 -0.661879 0.173155 -0.332854 0.286359 0.244246 0.260499 0.260091 0.193778 0.236359 0.391647 0.289226 0.307979 0.246353 0.350599 0.223965 0.231490 0.222411 0.251845 0.349880 0.338239
chargesum: 0.00000
title: Mulliken charges with hydrogens summed into heavy atoms:
elementType: S O O O N N N N N C C C C C C C C C C C C
charge: 0.163873 -0.312352 -0.055343 -0.083169 -0.190881 -0.083528 -0.178969 -0.061316 0.083848 -0.307053 0.204770 0.202798 0.195821 0.102848 0.237520 0.091618 -0.016639 -0.101979 0.015987 0.173155 -0.081009
polarizability: 2.53116078e+02 2.10392266e+00 2.07847056e+02 -1.27035322e+01 -1.25405929e+01 1.19253627e+02
1716.lowfreq: -3.9403 -0.0011 0.0002 0.0005 2.8609 5.7923 29.4490 29.9452 39.1552
frequency: 29.4299 29.8117 39.0439 61.1931 64.6207 76.3901 88.1020 99.0374 136.6317 152.3424 173.8208 194.7835 209.7590 237.5750 242.7490 248.4366 270.8169 288.0004 308.9325 317.2010 360.2381 400.7946 429.7875 464.4606 468.4855 519.3826 539.1004 551.0448 556.8785 557.7348 563.5410 608.8874 615.2837 625.7926 643.3850 664.1586 710.4295 754.7095 792.0250 793.3374 796.7310 830.2946 842.2723 866.3685 878.3017 930.5250 952.0806 961.5845 982.6619 996.6119 1006.4434 1013.5577 1017.9169 1043.2778 1045.9091 1057.4485 1083.8675 1092.1113 1112.1402 1146.5825 1170.8372 1179.4569 1190.2193 1205.2380 1222.5968 1241.6239 1247.5299 1268.6819 1280.3404 1288.7183 1293.8749 1301.3117 1317.0002 1325.9013 1337.8171 1346.2517 1356.7884 1373.3480 1381.5903 1383.7674 1397.3660 1432.7275 1455.2452 1470.8862 1471.9677 1473.1473 1477.8042 1483.4949 1539.3104 1581.4424 1637.1918 2948.4741 2961.8351 2965.9190 2984.5456 2994.6248 3010.7681 3020.8826 3025.9895 3075.5943 3083.8345 3087.7426 3112.6858 3172.1016 3262.7047 3536.1695 3552.2935 3690.2983
redmass: 5.7746 5.6226 3.8373 5.5024 4.5405 2.6807 4.9087 4.3767 4.0527 4.1216 6.4748 4.9873 6.2919 3.4405 3.3014 1.4794 3.9384 5.0804 5.6848 4.5280 5.3551 3.6117 1.4359 3.0287 3.6833 8.7227 1.3355 3.2049 1.6478 1.8490 3.7821 5.8673 5.7459 4.8191 4.6981 9.4040 7.2177 4.8195 7.0291 1.1044 4.1700 3.2999 1.6638 4.5467 1.2252 1.4265 3.6364 2.6143 5.5534 1.7763 2.4430 5.4591 3.7323 3.7627 1.4284 2.6443 3.1860 3.7605 2.1376 4.6019 1.2143 1.6930 1.3283 1.2695 2.4938 1.2416 1.4482 1.7007 1.5926 1.6572 1.8851 1.6373 1.3195 2.7774 1.3887 1.4206 1.2691 1.9591 6.6619 1.3995 1.2085 3.0635 1.0832 1.0837 1.0591 3.6010 1.3280 1.0491 8.4824 1.8126 2.8579 1.0759 1.0683 1.0765 1.0356 1.0852 1.0851 1.0602 1.0847 1.1003 1.0993 1.0957 1.1069 1.0926 1.0988 1.0445 1.0657 1.1056
irintensity: 0.7529 0.3391 2.1461 0.5747 1.6271 2.5462 1.2059 3.2004 4.2263 3.3222 2.2144 4.0198 4.1375 4.5959 0.6814 0.4326 5.3191 3.0240 4.3773 7.2458 11.3860 12.7672 165.7079 23.7847 4.7566 8.8881 220.2175 21.4597 4.2903 10.7316 15.8014 4.2306 2.1114 12.2045 45.0382 15.1165 25.3710 7.0078 6.3428 8.7105 43.5120 17.2245 11.0999 11.8915 114.7393 5.7709 89.1879 29.8000 160.9067 25.4349 8.0780 48.4464 18.1657 20.5787 1.3562 1.0881 20.5541 45.1953 3.0724 21.1719 11.0007 65.2792 30.3556 3.4156 33.0461 11.4815 3.6327 63.8054 95.9791 38.5484 24.5719 8.2365 0.9722 12.6455 41.1243 48.8911 18.7276 40.4207 13.0009 26.0941 19.4691 47.8307 3.2649 4.9036 27.7668 29.6315 149.3644 9.4697 43.2411 29.6848 661.7554 533.2294 65.4463 485.4352 29.6377 28.1132 4.9046 24.0683 32.0057 21.6941 18.6873 15.4515 21.4786 9.9781 3.2533 147.9588 8.6150 53.7415
temp: 298.150 k
press: 1.00000 atm
elementType: 16 8 8 8 7 7 7 7 7 6 6 6 6 6 6 6 6 6 6 6 6 1 1 1 1 1 1 1 1 1 1 1 1 1 1 1 1 1
symmnumber: 1
zpe: 778558.2 jmol-1
zpe.correction: 0.296537 hartree
zpe.thermalcorrener: 0.316904 hartree
zpe.thermalcorrenthalpy: 0.317848 hartree
zpe.thermalcorrgfe: 0.245778 hartree
zpe.sumelectzpe: -1363.379492 hartree
zpe.sumelectthermal: -1363.359126 hartree
zpe.sumelectthermalent: -1363.358182 hartree
zpe.sumelectthermalfe: -1363.430252 hartree
dipole: 2.5424 -0.9802 0.8880
dipole: 2.8658
quadrupole: -116.8161 -139.4037 -132.8770
quadrupole: 11.9309 -9.8882 4.2079
quadrupole: 12.8828 -9.7047 -3.1781 11.9309 -9.8882 4.2079
hfenergy: -1363.6760296 hartree
pointgroup: C01 [X(C12H17N5O3S1)]
dipole: 1.0260199 -0.3423056 0.3184187 debye
polarizability: 252.2333076|4.6726019|208.9371487|-14.5440171|-10.5024051|119.0463048 unknown
InChI: InChI=1S/C12H17N5O3S/c1-2-21-9-6(3-18)20-12(8(9)19)17-5-16-7-10(13)14-4-15-11(7)17/h4-6,8-9,12,18-19H,2-3,13H2,1H3
charge 0 multiplicity 1
38 atoms
S  -3.760966 -1.050023 -0.971063
O  -1.254375 1.906328 0.334405
O  -0.924702 -1.697541 0.953502
O  -3.483566 3.692849 -0.040181
N  0.920477 0.911003 0.172922
N  2.839227 1.87714 -0.636959
N  1.739748 -1.429681 0.448177
N  4.08636 -1.668018 -0.219846
N  5.381419 0.133289 -1.02862
C  -2.634738 -0.080512 0.185953
C  -1.160103 -0.517272 0.159547
C  -0.445479 0.75394 0.721564
C  -2.573022 1.402525 -0.225807
C  -3.66968 2.295802 0.352975
C  1.874548 -0.106957 0.1128
C  1.555009 2.080054 -0.282538
C  -3.989547 -2.613677 0.099873
C  3.051563 0.50877 -0.388231
C  -4.698353 -3.689772 -0.731996
C  4.190348 -0.334153 -0.552615
C  2.896227 -2.135214 0.251051
H  -3.022042 -0.19113 1.216685
H  -0.841091 -0.654924 -0.897052
H  -0.381676 0.693062 1.826531
H  -2.522408 1.522596 -1.325491
H  -3.687168 2.185927 1.458506
H  -4.647699 1.995831 -0.058123
H  0.079877 -1.884204 0.871874
H  1.021366 3.023755 -0.343884
H  -2.982857 -2.92217 0.422398
H  -4.58593 -2.323225 0.982284
H  -2.583217 3.973307 0.266942
H  -5.68542 -3.345416 -1.09032
H  -4.093233 -3.978621 -1.6094
H  -4.858163 -4.593269 -0.114706
H  2.862179 -3.199767 0.498281
H  5.475955 1.11468 -1.283057
H  6.162933 -0.511914 -1.127382
