program: Gaussian 09
title: 000234983
version: EM64L-G09RevD.01
frameworkgroup: C1[X(C12H17N5O3S)]
method: RPBEPBE
basis: SDD
operation: Freq
keyword: #p
keyword: freq=noraman
keyword: PBEPBE/SDD
title: #p freq=noraman PBEPBE/SDD
converged: YES YES NO NO
title: Mulliken charges:
elementType: S O O O N N N N N C C C C C C C C C C C C H H H H H H H H H H H H H H H H H
charge: 0.173447 -0.258222 -0.464036 -0.437031 -0.167220 -0.089535 -0.064080 -0.064970 -0.611074 -0.550762 -0.137425 -0.049363 -0.068977 -0.391931 0.159991 -0.193761 -0.574677 -0.095865 -0.659416 0.162385 -0.369202 0.329584 0.291285 0.281721 0.236947 0.227479 0.248729 0.350542 0.299789 0.253304 0.284782 0.343015 0.231775 0.227870 0.227792 0.241962 0.331416 0.343733
chargesum: 0.00000
title: Mulliken charges with hydrogens summed into heavy atoms:
elementType: S O O O N N N N N C C C C C C C C C C C C
charge: 0.173447 -0.258222 -0.113494 -0.094017 -0.167220 -0.089535 -0.064080 -0.064970 0.064075 -0.221178 0.144296 0.241921 0.167970 0.084278 0.159991 0.106028 -0.036591 -0.095865 0.028021 0.162385 -0.127240
polarizability: 2.50171937e+02 -1.02866725e+01 1.99174413e+02 3.96935427e+00 2.27803487e+01 1.27113771e+02
1716.lowfreq: -5.7861 -0.0006 0.0015 0.0018 2.1972 5.9544 17.1786 22.3475 40.4407
frequency: 16.0699 22.1270 40.2231 52.9052 57.6866 77.4934 101.7136 108.6984 122.4616 150.2727 161.8627 193.5772 213.4552 215.4422 224.8071 236.2689 256.5851 265.2072 274.6605 283.1346 300.9128 326.5867 367.1478 403.6077 453.0557 498.8245 509.0251 509.6291 545.8026 550.6430 564.0004 615.2173 619.9674 646.6859 665.2716 671.3834 708.3762 723.6410 768.0952 791.4406 796.1242 823.6052 845.8352 849.1466 855.6093 891.3374 925.8549 927.8539 943.4160 960.0914 965.0935 996.1851 1009.9440 1019.3088 1036.4115 1041.1879 1057.1065 1069.9575 1084.9698 1130.7634 1149.9634 1167.4230 1179.2808 1195.6415 1216.9040 1234.3276 1241.4891 1252.1957 1270.0786 1273.8820 1293.0272 1300.3482 1312.6895 1315.3919 1316.4283 1332.6467 1359.9794 1367.2596 1379.4394 1382.6470 1396.3967 1399.6576 1430.9111 1463.1021 1463.1819 1470.4418 1472.4867 1482.6694 1541.7471 1578.5457 1632.1619 2987.7771 3002.5303 3004.4055 3009.8942 3031.4495 3050.4151 3071.7247 3074.8868 3082.8309 3092.3568 3100.6339 3164.8044 3241.6652 3540.7631 3570.8842 3570.9385 3696.2662
redmass: 5.4755 5.5114 4.0658 6.1941 3.8970 2.3212 4.7410 5.4496 4.4741 5.5059 5.6165 6.5178 4.5160 5.3706 3.5625 1.2384 1.6437 2.1022 1.9934 3.5212 1.7627 3.6909 6.5766 4.2092 6.2415 4.4110 1.2387 8.4497 1.0452 4.4014 4.0692 5.3107 7.3645 5.1922 8.6213 7.2461 7.2320 5.7723 5.2584 1.1674 8.2266 4.6388 2.8485 1.5296 4.8832 4.5958 2.7746 1.5001 3.6677 2.4673 4.4949 1.8176 3.7705 4.8377 1.2700 2.2126 2.1945 2.3039 1.8806 3.4516 1.4777 1.2845 1.7489 1.3608 2.3677 1.5168 1.2353 1.6561 1.6615 1.6792 1.2643 5.8343 1.3953 2.1700 1.7452 1.3401 2.4763 1.2257 1.4134 3.3368 1.2102 1.4371 2.9411 2.0117 1.4699 1.0397 1.0771 1.0478 8.0474 1.8602 2.7818 1.0353 1.0860 1.0630 1.0571 1.0867 1.0870 1.0938 1.0983 1.0989 1.1039 1.1047 1.0920 1.1001 1.0442 1.0664 1.0667 1.1056
irintensity: 0.5715 0.0117 0.8994 1.2020 1.2262 3.3562 6.7018 4.5286 0.6647 2.3767 2.2117 4.0836 0.7000 6.8754 19.7979 2.3685 114.4411 80.6237 32.6114 10.0519 65.6578 23.8614 1.2317 9.9354 0.3392 24.4545 264.7804 4.9305 1.5785 5.1911 0.6030 2.6373 5.9616 49.4068 8.2330 19.1883 3.3317 9.6964 31.4563 10.7033 9.5760 36.8786 26.4662 8.8878 5.6791 23.6692 55.2066 21.2648 18.7566 5.3443 120.1788 25.9406 76.0050 123.7467 8.0923 48.0906 20.5258 1.9329 6.3653 17.6872 3.1010 46.7373 61.1246 7.7495 64.2369 62.0795 2.9598 5.4452 63.2244 91.4152 10.0406 20.1356 7.7082 7.8504 11.0112 21.3183 75.9076 3.1995 3.6092 15.7701 22.6928 4.5203 80.3330 15.5212 17.0044 15.8458 9.1769 7.8572 56.3227 35.6784 642.0425 31.2488 43.6014 32.0139 11.4732 10.7636 4.6492 4.4747 1.1601 19.9515 15.5077 35.4277 17.0687 16.8098 127.6856 6.8957 10.2794 48.3547
temp: 298.150 k
press: 1.00000 atm
elementType: 16 8 8 8 7 7 7 7 7 6 6 6 6 6 6 6 6 6 6 6 6 1 1 1 1 1 1 1 1 1 1 1 1 1 1 1 1 1
symmnumber: 1
zpe: 775840.1 jmol-1
zpe.correction: 0.295502 hartree
zpe.thermalcorrener: 0.316573 hartree
zpe.thermalcorrenthalpy: 0.317517 hartree
zpe.thermalcorrgfe: 0.243343 hartree
zpe.sumelectzpe: -1363.366973 hartree
zpe.sumelectthermal: -1363.345902 hartree
zpe.sumelectthermalent: -1363.344957 hartree
zpe.sumelectthermalfe: -1363.419132 hartree
dipole: 1.6352 -1.9002 -1.3869
dipole: 2.8650
quadrupole: -124.6853 -115.9994 -133.7179
quadrupole: -8.3288 5.7649 -1.4046
quadrupole: 0.1155 8.8015 -8.9170 -8.3288 5.7649 -1.4046
hfenergy: -1363.6624749 hartree
pointgroup: C01 [X(C12H17N5O3S1)]
dipole: 0.6399944 -0.6846936 -0.6261736 debye
polarizability: 245.3943179|-20.1246425|190.1675819|15.4795089|32.9527301|140.8982209 unknown
InChI: InChI=1S/C12H17N5O3S/c1-2-21-9-8(19)6(3-18)20-12(9)17-5-16-7-10(13)14-4-15-11(7)17/h4-6,8-9,12,18-19H,2-3,13H2,1H3
charge 0 multiplicity 1
38 atoms
S  3.061709 1.720161 0.057995
O  1.440064 -1.4219 0.969828
O  2.3836 -1.61797 -2.08428
O  5.143702 -2.095413 0.926412
N  -0.365876 -0.432676 -0.281872
N  -2.031991 -1.345424 -1.570172
N  -1.695541 1.256312 0.968462
N  -4.072503 1.207602 0.333944
N  -4.94273 -0.27913 -1.285464
C  2.034725 0.292005 -0.649098
C  2.93026 -0.942917 -0.888373
C  0.939625 -0.186399 0.346268
C  2.751114 -1.800878 0.385858
C  3.861703 -1.573509 1.431817
C  -1.542965 0.241605 0.068912
C  -0.72003 -1.37063 -1.270062
C  1.735608 3.087576 -0.031821
C  -2.558435 -0.33678 -0.736911
C  2.326744 4.389487 0.525232
C  -3.872583 0.190038 -0.572028
C  -2.996218 1.675244 1.037339
H  1.602703 0.631298 -1.60374
H  0.743719 0.54964 1.144965
H  3.99189 -0.6773 -1.046154
H  2.688645 -2.876516 0.128392
H  3.567463 -2.043872 2.389924
H  4.025152 -0.496764 1.601568
H  3.023182 -2.311434 -2.385055
H  0.0269 -2.013239 -1.729789
H  1.448637 3.193216 -1.092727
H  0.856373 2.761871 0.550679
H  5.167248 -3.077961 1.045048
H  2.620227 4.275953 1.583784
H  3.21429 4.709649 -0.048891
H  1.572658 5.195601 0.466561
H  -3.206144 2.485743 1.741631
H  -5.860193 0.132203 -1.127963
H  -4.811936 -1.03289 -1.956617
