program: Gaussian 09
title: 000234979
version: EM64L-G09RevD.01
frameworkgroup: C1[X(C18H17N2OPS)]
method: RPBEPBE
basis: SDD
operation: Freq
keyword: #p
keyword: freq=noraman
keyword: PBEPBE/SDD
title: #p freq=noraman PBEPBE/SDD
converged: YES YES NO NO
title: Mulliken charges:
elementType: S P O N N C C C C C C C C C C C C C C C C C C H H H H H H H H H H H H H H H H H
charge: -0.133911 0.749597 -0.461124 -0.804821 -0.862391 0.547465 0.540353 0.369960 -0.428298 -0.414048 -0.348915 -0.361638 -0.334723 -0.389425 -0.194506 -0.193360 -0.215053 -0.213336 -0.257207 -0.260711 -0.208802 -0.199807 -0.242413 0.367526 0.363339 0.228015 0.220798 0.276984 0.270440 0.266235 0.251935 0.227285 0.226189 0.229764 0.227792 0.230922 0.230120 0.233624 0.232723 0.233422
chargesum: 0.00000
title: Mulliken charges with hydrogens summed into heavy atoms:
elementType: S P O N N C C C C C C C C C C C C C C C C C C
charge: -0.133911 0.749597 -0.461124 -0.437296 -0.499052 0.547465 0.540353 0.369960 -0.200283 -0.193250 -0.071930 -0.091198 -0.068488 -0.137490 0.032779 0.032829 0.014711 0.014456 -0.026285 -0.030591 0.024821 0.032916 -0.008991
polarizability: 2.87066836e+02 -2.24740440e+01 2.75064566e+02 -9.18471569e-01 -1.24479008e+01 2.05251475e+02
1716.lowfreq: -7.6907 -6.3151 -5.8233 -0.0014 -0.0014 -0.0013 10.2779 17.5239 31.7417
frequency: 8.6631 17.3785 31.6788 34.7701 41.7731 48.2379 85.6200 88.0179 103.0534 150.1937 156.4308 185.9747 187.3963 203.4514 253.5755 270.0359 313.3106 318.4121 379.3790 403.5604 404.8661 411.2364 414.7791 427.5110 461.6352 492.5383 515.1195 523.6994 547.1425 556.3885 573.1181 591.8389 607.7617 612.0306 613.8040 633.5352 694.0014 694.4222 697.0480 758.9277 762.1090 767.6714 775.6036 785.4038 805.5816 826.6690 830.9961 840.2940 880.8196 890.8949 899.8117 902.1787 915.2903 963.0363 965.7206 970.4548 982.4502 984.3877 985.8667 986.6883 988.4897 992.4875 1018.4266 1026.5680 1027.0828 1073.9546 1088.7815 1089.2826 1151.5734 1170.5387 1171.6164 1172.0793 1181.3891 1191.7677 1192.2397 1248.6589 1250.2308 1302.5598 1308.4647 1314.0376 1360.9874 1363.9671 1377.3562 1400.4187 1406.4961 1436.3265 1462.6680 1465.1067 1468.0418 1483.6719 1487.4859 1590.7223 1594.8053 1595.4033 1596.8558 1612.7983 1616.3791 3117.2748 3119.6858 3130.3381 3130.8122 3133.3601 3138.6139 3141.6982 3144.2740 3151.2089 3151.2692 3155.8541 3162.7606 3169.2818 3170.1144 3173.1890 3521.3723 3522.4798
redmass: 5.0111 5.9619 5.5775 4.0667 3.9339 4.0397 6.9385 7.7052 5.6066 8.0458 6.0411 5.6263 5.7335 5.4083 4.9871 3.6637 5.7758 6.6347 6.2026 2.9424 2.8818 3.5404 2.9552 1.8569 4.2093 1.8229 3.0690 3.1486 2.4626 4.4123 6.1930 6.5488 6.5113 6.4390 6.4941 6.6979 1.8483 1.9175 2.1345 2.0413 1.8052 1.7205 4.6237 4.2692 6.6989 1.2627 1.2689 1.2394 4.5660 2.2670 2.0402 1.7212 1.4558 1.3754 1.3734 1.3653 3.5025 4.6849 1.5672 5.1922 1.4133 1.3531 2.1349 2.1203 2.1083 1.5242 1.5684 1.5637 2.4236 1.0807 1.0486 1.0502 1.3418 1.1099 1.1120 1.9944 2.0473 1.3620 1.6403 1.7048 1.7656 2.0186 8.6340 3.1766 2.7366 2.2186 2.0709 2.1769 1.9971 2.3950 2.4934 6.4752 6.1291 5.9498 5.7929 6.1088 6.1358 1.0875 1.0875 1.0850 1.0862 1.0866 1.0886 1.0919 1.0924 1.0957 1.0938 1.0955 1.0964 1.1014 1.1015 1.1006 1.0755 1.0758
irintensity: 0.1685 0.3004 0.2130 0.1024 0.0678 0.2885 0.5474 0.9651 3.3187 2.3483 0.4649 3.7512 4.0338 0.2883 2.4980 0.5149 1.4575 12.7316 6.5122 6.3953 0.2373 21.5371 4.9143 18.8561 54.3921 82.4640 1.5629 20.1359 33.9922 48.5377 1.8654 9.8278 24.2679 9.4549 7.1458 165.3804 30.7521 39.3897 33.5141 64.7770 33.7381 87.7708 45.5108 75.1926 208.8298 0.9089 2.2405 0.7430 153.8426 19.9489 71.9449 35.0926 16.7580 0.2400 0.0870 0.6635 0.9021 0.5541 1.4644 0.4355 0.8553 0.5922 18.1294 25.6452 8.4409 8.1164 18.9751 17.5408 138.8779 5.7848 0.8832 0.7258 46.1205 4.4383 2.8493 56.0859 72.2937 11.9275 142.4436 48.3260 83.7375 36.2757 0.3853 28.1984 34.7491 4.3359 29.8939 113.0676 0.5557 208.6054 69.8948 9.5774 33.9940 9.0954 2.1052 154.8647 66.9069 11.1141 10.0907 2.1519 1.6502 0.2044 6.4122 16.8040 23.0517 21.2182 23.1469 20.3916 12.4800 21.3167 18.3139 12.5157 41.0494 30.6447
temp: 298.150 k
press: 1.00000 atm
elementType: 16 15 8 7 7 6 6 6 6 6 6 6 6 6 6 6 6 6 6 6 6 6 6 1 1 1 1 1 1 1 1 1 1 1 1 1 1 1 1 1
symmnumber: 1
zpe: 805969.3 jmol-1
zpe.correction: 0.306978 hartree
zpe.thermalcorrener: 0.328261 hartree
zpe.thermalcorrenthalpy: 0.329205 hartree
zpe.thermalcorrgfe: 0.252423 hartree
zpe.sumelectzpe: -1618.516332 hartree
zpe.sumelectthermal: -1618.495048 hartree
zpe.sumelectthermalent: -1618.494104 hartree
zpe.sumelectthermalfe: -1618.570887 hartree
dipole: 0.0499 2.1304 -4.7557
dipole: 5.2113
quadrupole: -137.7256 -135.3529 -156.2772
quadrupole: -7.2260 -0.0026 2.0179
quadrupole: 5.3930 7.7657 -13.1586 -7.2260 -0.0026 2.0179
hfenergy: -1618.8233095 hartree
pointgroup: C01 [X(C18H17N2O1P1S1)]
dipole: 0.194134 0.4600149 1.9885594 debye
polarizability: 299.6435295|11.5860854|256.1791012|9.1221408|21.3446552|211.560246 unknown
InChI: InChI=1S/C18H17N2OPS/c23-22(19-16-10-4-1-5-11-16,20-17-12-6-2-7-13-17)21-18-14-8-3-9-15-18/h1-15,19-20H
charge 0 multiplicity 1
40 atoms
S  0.02005 -0.802315 -3.184373
P  0.235011 0.080861 -1.349023
O  -0.01744 1.847043 -1.522931
N  -0.741669 -0.511134 -0.038312
N  1.772127 0.139422 -0.518484
C  -2.11414 -0.879865 -0.045051
C  2.615951 -0.960659 -0.201105
C  -0.082047 2.715802 -0.396871
C  -2.624762 -1.605072 1.065119
C  3.896992 -0.696018 0.355162
C  -2.981814 -0.522584 -1.110829
C  2.20819 -2.305709 -0.408583
C  -1.188795 2.692181 0.483905
C  0.961108 3.658337 -0.235127
C  -3.988074 -1.962806 1.108372
C  4.749532 -1.762418 0.707575
C  -4.34031 -0.901533 -1.060277
C  3.074059 -3.361951 -0.053034
C  -4.854576 -1.61756 0.044996
C  4.34532 -3.103102 0.508549
C  -1.235228 3.619499 1.548928
C  0.895166 4.586514 0.82835
C  -0.196729 4.563731 1.727844
H  -0.241265 -0.585806 0.852661
H  2.190678 1.07175 -0.452117
H  -1.954319 -1.890619 1.885329
H  4.220559 0.340696 0.512083
H  -2.599291 0.032054 -1.973573
H  1.238014 -2.526216 -0.866402
H  -2.00282 1.978888 0.322104
H  1.780706 3.679864 -0.962185
H  -4.370825 -2.519094 1.971314
H  5.733964 -1.543017 1.136059
H  -5.000713 -0.627591 -1.890449
H  2.750955 -4.394801 -0.224814
H  -5.911391 -1.901852 0.07769
H  5.010864 -3.928941 0.779658
H  -2.091113 3.610102 2.232739
H  1.692779 5.327672 0.949889
H  -0.243501 5.28235 2.552917
