program: Gaussian 09
title: 000234970
version: EM64L-G09RevD.01
frameworkgroup: C1[X(C12H17N5O)]
method: RPBEPBE
basis: SDD
operation: Freq
keyword: #p
keyword: freq=noraman
keyword: PBEPBE/SDD
title: #p freq=noraman PBEPBE/SDD
converged: YES YES NO NO
title: Mulliken charges:
elementType: O N N N N N C C C C C C C C C C C C H H H H H H H H H H H H H H H H H
charge: -0.258615 -0.191313 -0.110682 -0.052550 -0.115238 -0.084361 -0.007847 -0.419148 -0.410656 -0.377136 -0.307913 0.130062 -0.076388 -0.223374 0.218236 -0.391002 -0.671923 -0.615275 0.251502 0.216486 0.231183 0.225924 0.204258 0.204096 0.212718 0.187566 0.227022 0.278577 0.239390 0.224285 0.316460 0.225883 0.254731 0.213555 0.251489
chargesum: 0.00000
title: Mulliken charges with hydrogens summed into heavy atoms:
elementType: O N N N N N C C C C C C C C C C C C
charge: -0.258615 -0.191313 -0.110682 -0.052550 -0.115238 -0.084361 0.243655 0.028521 0.019525 0.039678 0.106674 0.130062 -0.076388 0.055203 0.218236 -0.151612 0.094705 0.104501
polarizability: 2.50435812e+02 1.99025905e+00 1.61595698e+02 -1.76572817e+00 -2.20725904e+00 1.04484187e+02
1716.lowfreq: -61.8573 -14.7395 -2.4494 -0.0011 -0.0006 -0.0005 4.0350 17.6736 41.7551
frequency: -61.8416 16.6136 41.6229 61.9691 90.6682 112.4186 160.7781 168.5625 204.2693 220.4025 227.7202 234.9405 258.5261 304.0432 328.3392 359.5287 378.8313 388.5444 443.6541 454.1535 503.3185 523.5211 561.5861 595.3181 623.3073 645.6085 664.9225 670.2466 774.1454 786.3482 798.8818 820.2531 829.3443 833.0554 861.1604 880.7324 908.3977 928.8975 931.2312 980.4821 1012.2169 1032.1575 1044.2522 1064.3121 1090.1552 1092.2196 1094.2867 1114.2421 1138.7708 1142.6521 1165.3474 1190.4993 1194.8907 1209.2497 1246.2712 1250.6137 1256.0758 1286.2812 1296.4251 1313.4685 1332.1177 1336.2199 1338.9984 1344.4451 1361.3837 1363.2871 1386.1489 1395.5359 1414.5968 1436.9665 1446.7878 1448.9169 1453.3019 1456.5033 1460.4279 1469.3261 1474.0134 1487.2921 1499.7319 1503.2415 1530.4379 1601.4136 2946.4253 2957.6888 2967.1768 2977.3875 2990.5305 2991.2668 2994.5234 3034.3959 3046.8855 3054.8036 3064.5381 3075.6912 3084.4449 3092.9492 3107.6621 3155.3955 3249.2233
redmass: 1.1459 3.7297 4.0347 3.9659 2.4672 3.7544 3.2961 1.5592 4.4995 4.7638 2.2484 2.5901 3.8790 3.9891 1.9435 3.3358 5.7161 4.1286 3.9033 3.0954 4.1269 1.8026 4.0059 5.4432 7.1581 5.0796 7.9344 6.5088 3.0603 5.4742 2.9611 1.6543 2.7985 2.8724 2.4707 2.9414 3.6071 1.4306 1.9714 2.1091 3.0988 2.7427 2.2670 1.5591 2.2663 3.9372 1.2551 2.7472 1.3503 2.4872 1.4596 1.4521 2.1092 2.0131 2.7801 1.3243 1.5088 2.2822 3.6997 1.4709 1.6340 3.3033 1.5193 1.4653 1.3499 3.0870 1.4992 2.1446 1.9973 1.3582 1.2738 1.3165 1.0440 1.0990 1.0860 1.6343 1.0923 1.0854 1.0472 1.7847 8.5530 5.8644 1.0687 1.0346 1.0844 1.0645 1.0605 1.0338 1.0610 1.1012 1.0972 1.1015 1.1034 1.1007 1.0969 1.1017 1.1022 1.0917 1.0985
irintensity: 0.1792 0.4183 4.1577 2.5895 0.0182 1.7752 2.1843 0.5101 0.6034 0.8244 6.3958 1.9525 1.1536 1.5635 0.2606 6.6654 1.8981 8.3064 2.1370 3.9015 0.2676 3.8684 0.2797 3.4340 4.8270 20.8551 0.6540 15.6266 10.8375 11.1159 9.0611 13.0079 2.8691 3.7841 11.8769 37.6722 10.0425 13.0221 15.8263 73.9700 128.3685 53.6032 6.2588 34.9609 11.2704 7.6539 0.5212 5.8392 0.4905 8.9929 13.0049 44.0279 6.2777 154.2797 7.7010 14.8863 16.0421 32.9721 25.8080 32.8698 48.9493 46.3337 3.1765 3.9227 28.2199 52.1746 1.3231 24.3787 57.8794 13.2305 11.1356 1.2642 12.9826 14.2475 6.8753 72.1042 14.1156 10.9657 12.1403 22.3640 73.9068 611.2603 61.4548 116.7988 3.9895 31.1921 48.2765 68.5978 22.7556 37.9150 39.0573 39.9331 42.0456 22.6743 35.6443 8.7676 18.5092 23.0732 0.6437
temp: 298.150 k
press: 1.00000 atm
elementType: 8 7 7 7 7 7 6 6 6 6 6 6 6 6 6 6 6 6 1 1 1 1 1 1 1 1 1 1 1 1 1 1 1 1 1
symmnumber: 1
zpe: 754501.6 jmol-1
zpe.correction: 0.287374 hartree
zpe.thermalcorrener: 0.303037 hartree
zpe.thermalcorrenthalpy: 0.303981 hartree
zpe.thermalcorrgfe: 0.243105 hartree
zpe.sumelectzpe: -815.103454 hartree
zpe.sumelectthermal: -815.087791 hartree
zpe.sumelectthermalent: -815.086847 hartree
zpe.sumelectthermalfe: -815.147722 hartree
dipole: 2.2624 -1.0427 1.2485
dipole: 2.7864
quadrupole: -76.2381 -110.6147 -108.0758
quadrupole: 5.3441 1.4242 -1.0575
quadrupole: 22.0714 -12.3052 -9.7662 5.3441 1.4242 -1.0575
hfenergy: -815.390828 hartree
pointgroup: C01 [X(C12H17N5O1)]
dipole: -0.8987693 0.2988563 0.5519847 debye
polarizability: 250.2964627|3.7865829|159.3043719|2.1565505|11.7716828|106.9148626 unknown
InChI: InChI=1S/C12H17N5O/c1-16(2)11-10-12(14-7-13-11)17(8-15-10)9-5-3-4-6-18-9/h7-9H,3-6H2,1-2H3
charge 0 multiplicity 1
35 atoms
O  -2.900174 0.704681 -0.992026
N  -0.856999 0.302337 0.083681
N  0.89599 1.734119 0.407179
N  0.372116 -1.785182 -0.411947
N  3.888154 0.562068 0.136286
N  2.804378 -1.465306 -0.341518
C  -2.221922 -0.199362 -0.046448
C  -2.975747 -0.252355 1.299717
C  -4.435516 -0.711289 1.066325
C  -5.123902 0.19506 0.018161
C  -4.279942 0.246378 -1.26842
C  0.304257 -0.457525 -0.105136
C  1.389168 0.441622 0.106284
C  -0.441196 1.605411 0.383471
C  2.708137 -0.11918 -0.025175
C  1.669821 -2.200751 -0.512573
C  3.955344 2.000071 0.451864
C  5.162435 -0.16418 -0.038161
H  -2.140797 -1.219344 -0.480154
H  -2.963853 0.755893 1.756949
H  -2.445552 -0.94143 1.982718
H  -4.993775 -0.701018 2.019935
H  -4.437219 -1.760235 0.704723
H  -6.137225 -0.180526 -0.221937
H  -5.23344 1.219965 0.421781
H  -4.240965 -0.758513 -1.744325
H  -4.671693 0.973182 -1.998273
H  -1.148523 2.415269 0.537111
H  1.821025 -3.255659 -0.762261
H  4.50574 2.158234 1.399527
H  2.940249 2.413102 0.553134
H  4.486764 2.544607 -0.352878
H  5.222314 -1.026169 0.648273
H  5.989427 0.534453 0.169273
H  5.258623 -0.557427 -1.06576
