program: Gaussian 09
title: 000234968
version: EM64L-G09RevD.01
frameworkgroup: C1[X(C13H11ClN4S2)]
method: RPBEPBE
basis: SDD
operation: Freq
keyword: #p
keyword: freq=noraman
keyword: PBEPBE/SDD
title: #p freq=noraman PBEPBE/SDD
converged: YES YES NO NO
title: Mulliken charges:
elementType: Cl S S N N N N C C C C C C C C C C C C C H H H H H H H H H H H
charge: -0.006363 0.270903 0.272923 -0.268273 0.008195 0.084903 0.102783 0.105815 0.160128 0.439359 -0.236406 -0.417444 -0.341261 -0.359540 -0.214425 -0.211362 -0.405146 -0.237412 -0.802212 -0.821569 0.268065 0.266398 0.235512 0.234177 0.235135 0.288775 0.240953 0.291667 0.286372 0.285936 0.243415
chargesum: 0.00000
title: Mulliken charges with hydrogens summed into heavy atoms:
elementType: Cl S S N N N N C C C C C C C C C C C C C
charge: -0.006363 0.270903 0.272923 -0.268273 0.008195 0.084903 0.102783 0.105815 0.160128 0.439359 -0.236406 -0.417444 -0.073197 -0.093142 0.021087 0.022815 -0.405146 -0.002277 0.019184 -0.005845
polarizability: 3.22891467e+02 -3.92643034e+00 2.60324456e+02 6.91349302e+00 1.07815018e+01 1.05563425e+02
1716.lowfreq: -3.8090 -3.2604 -0.0021 -0.0015 -0.0014 2.8171 31.8955 42.7273 52.8564
frequency: 31.8906 42.7267 52.8562 66.3145 68.8919 90.2960 102.4523 107.3016 128.3355 140.4175 149.0434 171.1846 199.8252 222.0689 230.7279 249.5253 278.7007 327.2249 375.2766 383.1599 401.3143 407.4422 426.8929 478.1017 502.6897 580.0925 610.3331 622.8227 642.3769 652.9019 661.5949 662.2724 666.0147 696.4042 710.6975 754.4990 775.7171 787.8251 827.6190 841.1620 918.5620 938.7036 973.6598 978.8976 983.0337 986.4840 990.1963 997.2984 999.9051 1006.4735 1032.6315 1086.7710 1131.5593 1175.6826 1189.2793 1193.5336 1206.8164 1281.6262 1296.3907 1322.8851 1327.9942 1342.5459 1348.7720 1371.5095 1384.7695 1411.3939 1433.7331 1434.2990 1445.3795 1448.7416 1452.0687 1488.1514 1507.9168 1535.7895 1598.5967 1611.1575 3028.0626 3030.5031 3135.5713 3145.6438 3153.5716 3157.4626 3158.7474 3161.0477 3166.6576 3169.2903 3182.2717
redmass: 6.7186 3.9943 4.1741 4.9268 4.3288 3.0046 2.0054 2.0176 1.2860 5.2548 4.8829 7.4599 5.8358 5.0175 5.7775 5.7278 6.3212 16.9254 9.6177 8.9454 10.8451 2.9930 10.1687 9.2243 3.8939 12.1945 6.5424 9.1053 7.7281 7.5443 12.3252 8.3664 8.2427 2.1965 5.4492 4.0846 2.7020 10.0083 13.3377 1.2493 1.4830 7.4492 1.3833 1.1796 2.2478 1.1835 5.3609 1.3416 1.4492 1.8828 2.0281 1.5899 9.3460 1.0513 1.3690 3.2378 9.3447 9.1087 5.1671 5.6592 1.6012 1.3392 1.1926 4.5516 9.5067 6.2263 1.0520 1.0520 2.2766 1.0652 1.0850 2.5626 10.9115 10.9296 6.6502 6.0697 1.0282 1.0277 1.0854 1.0893 1.1043 1.0942 1.1048 1.1057 1.1063 1.0984 1.0984
irintensity: 0.7248 1.0249 3.4146 1.7051 0.3187 1.1423 0.6302 0.5341 0.2061 1.8830 0.0382 0.1389 3.4717 0.3800 2.9152 1.1254 7.1526 0.3854 3.8285 2.4907 2.9224 0.3638 3.5475 7.5808 5.7855 0.6273 2.4267 22.6503 6.0710 2.5797 3.0672 11.7469 11.8951 40.1427 39.4258 26.1037 36.8609 2.9630 57.9680 0.5275 8.1634 48.3429 0.7547 6.3975 15.7802 5.2322 1.6607 0.0531 17.0428 1.7822 24.3563 9.0720 140.4422 0.1253 50.8801 138.9046 90.5099 76.6395 67.8089 170.3749 11.9737 21.7637 2.1141 94.0808 7.7103 223.4142 13.3067 16.5634 8.4718 33.3114 37.2419 152.9134 175.6426 200.8695 7.8168 20.0970 20.9219 18.1541 0.4620 7.6472 7.6804 22.7013 6.0960 8.1589 6.5962 19.7812 2.8335
temp: 298.150 k
press: 1.00000 atm
elementType: 17 16 16 7 7 7 7 6 6 6 6 6 6 6 6 6 6 6 6 6 1 1 1 1 1 1 1 1 1 1 1
symmnumber: 1
zpe: 570912.0 jmol-1
zpe.correction: 0.217449 hartree
zpe.thermalcorrener: 0.236613 hartree
zpe.thermalcorrenthalpy: 0.237557 hartree
zpe.thermalcorrgfe: 0.167880 hartree
zpe.sumelectzpe: -1975.755326 hartree
zpe.sumelectthermal: -1975.736162 hartree
zpe.sumelectthermalent: -1975.735217 hartree
zpe.sumelectthermalfe: -1975.804895 hartree
dipole: 2.5852 2.5733 -0.2390
dipole: 3.6554
quadrupole: -116.6492 -134.9682 -136.2650
quadrupole: -6.3752 2.2984 3.4646
quadrupole: 12.6449 -5.6741 -6.9709 -6.3752 2.2984 3.4646
hfenergy: -1975.9727744 hartree
pointgroup: C01 [X(C13H11Cl1N4S2)]
dipole: -0.8789107 1.1267807 -0.1618068 debye
polarizability: 320.0515171|0.5449361|253.1075847|25.2016532|-34.6046362|115.620246 unknown
InChI: InChI=1S/C13H11ClN4S2/c1-19-11-9-10(16-12(14)17-11)18(13(15-9)20-2)8-6-4-3-5-7-8/h3-7H,1-2H3
charge 0 multiplicity 1
31 atoms
Cl 2.26377 -3.639091 0.972191
S  -1.662902 3.10684 -0.242504
S  4.156433 1.413629 0.399935
N  -0.804399 0.442513 0.125334
N  0.887263 2.015334 0.05364
N  0.588704 -1.577282 0.537179
N  2.97142 -1.06064 0.65785
C  0.403004 -0.247456 0.333544
C  1.432858 0.743654 0.276354
C  -2.124027 -0.138579 0.081428
C  -0.438397 1.805645 -0.029298
C  2.759202 0.272809 0.450198
C  -2.503978 -1.0716 1.074697
C  -3.014747 0.211318 -0.960867
C  -3.791009 -1.64718 1.025641
C  -4.305456 -0.359183 -0.989555
C  1.896453 -1.882622 0.686268
C  -4.697387 -1.288552 0.000993
C  -0.483389 4.577699 -0.202289
C  5.57342 0.206429 0.684086
H  -1.797686 -1.349678 1.861193
H  -2.700368 0.908215 -1.744257
H  -4.08514 -2.373456 1.790468
H  -4.997353 -0.086515 -1.79331
H  -5.697223 -1.734389 -0.029103
H  0.040351 4.598645 0.762671
H  -1.125562 5.462379 -0.330349
H  0.241329 4.486166 -1.02213
H  5.588324 -0.543464 -0.118365
H  5.448181 -0.290778 1.655476
H  6.485011 0.823389 0.668184
