program: Gaussian 09
title: 000234964
version: EM64L-G09RevD.01
frameworkgroup: C1[X(C14H12ClNO2)]
method: RPBEPBE
basis: SDD
operation: Freq
keyword: #p
keyword: freq=noraman
keyword: PBEPBE/SDD
title: #p freq=noraman PBEPBE/SDD
converged: YES YES NO NO
title: Mulliken charges:
elementType: Cl O O N C C C C C C C C C C C C C C H H H H H H H H H H H H
charge: 0.004783 -0.191545 -0.192946 -0.174296 -0.106567 -0.060297 -0.697384 -0.711571 0.523798 -0.166680 -0.628454 0.333175 0.019473 0.286146 -0.373616 -0.369512 -0.229273 -0.222965 0.260537 0.257937 0.240712 0.217461 0.223746 0.258206 0.218954 0.213660 0.288761 0.295508 0.240803 0.241448
chargesum: 0.00000
title: Mulliken charges with hydrogens summed into heavy atoms:
elementType: Cl O O N C C C C C C C C C C C C C C
charge: 0.004783 -0.191545 -0.192946 -0.174296 0.153970 0.197640 -0.015466 -0.020752 0.523798 -0.166680 -0.628454 0.333175 0.019473 0.286146 -0.084855 -0.074004 0.011530 0.018483
polarizability: 2.77310776e+02 -1.04034939e+01 2.12398300e+02 2.53828218e-01 1.90302262e-02 8.17158280e+01
1716.lowfreq: -0.0019 -0.0018 -0.0015 2.2380 4.3148 10.8169 39.4868 58.2876 68.0340
frequency: 39.3966 58.2719 68.0240 99.1542 119.4994 132.2308 157.9055 166.3918 176.7563 192.6014 226.9070 239.4256 272.8861 283.6890 300.1880 325.0360 371.4036 417.6569 422.6014 436.5546 446.6289 484.4560 504.0216 542.0384 558.0268 631.5836 684.3834 685.8967 723.0639 734.8779 777.6041 803.1547 805.1779 834.0549 848.6571 884.0042 931.7667 951.1584 995.5295 1007.3546 1010.6518 1013.7169 1045.4045 1052.3270 1083.4928 1087.8660 1111.8986 1133.0917 1149.9440 1162.6569 1172.2720 1213.7191 1245.1272 1271.0732 1289.2477 1340.6796 1355.0721 1389.7535 1396.3645 1400.0604 1431.8970 1439.4078 1453.6914 1469.9966 1470.8284 1473.3101 1492.0843 1527.3651 1550.8907 1569.5198 1599.2741 1607.4632 2994.0073 2996.8927 3074.5958 3086.2700 3086.8179 3092.2105 3107.0168 3115.0947 3137.6969 3152.7115 3163.6512 3172.9975
redmass: 5.0196 4.5674 6.2685 4.1512 4.4064 5.5483 1.0650 1.2667 5.5629 5.6341 2.9355 3.3842 4.4153 7.0660 5.5088 8.6915 10.7849 3.9650 3.6070 5.1362 5.9804 6.3721 2.7475 6.4245 6.0487 6.7553 5.1668 6.0803 3.0949 3.2277 4.8018 2.4218 2.5834 4.6395 3.3927 4.3031 1.6988 1.1377 1.3929 1.3269 3.9052 1.3598 2.1585 2.2999 2.5056 1.9769 1.7669 2.1037 1.9266 1.7408 1.0814 2.5029 1.9129 3.5936 2.4192 2.1111 1.3011 1.3096 1.2266 9.8893 2.9493 2.5339 1.0466 2.1047 1.3292 1.0479 1.0832 10.2568 10.6988 10.2269 8.1619 7.0352 1.0362 1.0364 1.0871 1.0943 1.0964 1.0976 1.0994 1.0986 1.0863 1.0904 1.0946 1.1002
irintensity: 4.3514 0.7413 1.7505 1.0634 2.3759 0.7396 0.4111 1.5091 2.1986 1.2919 4.0032 2.8672 0.9950 3.5245 2.9999 0.5311 22.6472 0.3546 0.3523 4.5898 14.9500 13.3044 3.8429 7.4631 10.9517 20.3048 7.0311 5.3439 25.8234 30.2348 40.1946 35.7206 29.1068 15.7901 3.1639 3.6159 0.2601 13.6992 3.8385 0.3658 35.2710 0.2138 9.3871 18.7990 5.4587 29.3080 22.4180 68.3348 51.6974 0.6566 8.9600 82.5850 37.4679 276.2072 26.0099 81.5988 4.4642 20.5817 34.0761 0.1560 120.6390 16.0566 17.2280 19.0962 18.8151 0.8584 23.6711 131.8090 359.0550 400.3717 53.8249 29.2681 13.1459 45.2944 0.5783 4.2334 12.9864 30.9114 17.6291 40.0163 4.3321 6.0881 1.6838 26.9172
temp: 298.150 k
press: 1.00000 atm
elementType: 17 8 8 7 6 6 6 6 6 6 6 6 6 6 6 6 6 6 1 1 1 1 1 1 1 1 1 1 1 1
symmnumber: 1
zpe: 589341.0 jmol-1
zpe.correction: 0.224468 hartree
zpe.thermalcorrener: 0.240946 hartree
zpe.thermalcorrenthalpy: 0.241890 hartree
zpe.thermalcorrgfe: 0.180187 hartree
zpe.sumelectzpe: -1204.632998 hartree
zpe.sumelectthermal: -1204.616521 hartree
zpe.sumelectthermalent: -1204.615576 hartree
zpe.sumelectthermalfe: -1204.677279 hartree
dipole: 1.0738 -3.5461 1.0977
dipole: 3.8643
quadrupole: -83.0928 -123.7674 -111.6312
quadrupole: 5.1917 2.4334 -0.5356
quadrupole: 23.0710 -17.6036 -5.4674 5.1917 2.4334 -0.5356
hfenergy: -1204.8574666 hartree
pointgroup: C01 [X(C14H12Cl1N1O2)]
dipole: -0.4783193 -1.3832829 -0.4112912 debye
polarizability: 278.0193907|7.3279506|211.4731029|5.2307519|-2.9733701|81.9324104 unknown
InChI: InChI=1S/C14H12ClNO2/c1-7-8(2)16(7)12-11(15)13(17)9-5-3-4-6-10(9)14(12)18/h3-8H,1-2H3
charge 0 multiplicity 1
30 atoms
Cl -1.445422 2.851087 -0.133272
O  -0.411874 -2.244755 -0.021432
O  1.559372 2.899002 -0.140619
N  -2.21367 -0.161655 -0.003357
C  -3.418204 0.296449 -0.756693
C  -3.042542 -1.201977 -0.667014
C  -4.56613 0.926817 0.007596
C  -3.770088 -2.21504 0.194783
C  -0.874178 0.126506 -0.088996
C  0.062012 -1.067127 -0.039357
C  -0.337063 1.412702 -0.114728
C  1.526312 -0.803625 -0.019845
C  1.098327 1.711912 -0.103867
C  2.026045 0.527005 -0.050255
C  2.426179 -1.896892 0.034052
C  3.420736 0.752601 -0.027528
C  3.816952 -1.666178 0.056162
C  4.314226 -0.339598 0.025218
H  -3.195768 0.77228 -1.723013
H  -2.599247 -1.625689 -1.579643
H  -4.351229 1.991369 0.205583
H  -5.494406 0.865036 -0.58931
H  -4.736052 0.426284 0.974675
H  -3.068899 -3.018181 0.478749
H  -4.165677 -1.760467 1.117866
H  -4.610219 -2.661237 -0.367996
H  2.014693 -2.910818 0.05812
H  3.776522 1.787149 -0.051534
H  4.512164 -2.511148 0.097474
H  5.394526 -0.160216 0.042979
