program: Gaussian 09
title: 000234963
version: EM64L-G09RevD.01
frameworkgroup: C1[X(C12H8ClNO2)]
method: RPBEPBE
basis: SDD
operation: Freq
keyword: #p
keyword: freq=noraman
keyword: PBEPBE/SDD
title: #p freq=noraman PBEPBE/SDD
converged: YES YES NO NO
title: Mulliken charges:
elementType: Cl O O N C C C C C C C C C C C C H H H H H H H H
charge: 0.012092 -0.186558 -0.192172 -0.132911 -0.413894 -0.378413 0.520062 -0.162175 -0.613893 0.334542 0.283340 0.025277 -0.371007 -0.368488 -0.228849 -0.222007 0.256102 0.257853 0.260033 0.253153 0.289039 0.295566 0.241453 0.241856
chargesum: 0.00000
title: Mulliken charges with hydrogens summed into heavy atoms:
elementType: Cl O O N C C C C C C C C C C C C
charge: 0.012092 -0.186558 -0.192172 -0.132911 0.100062 0.134772 0.520062 -0.162175 -0.613893 0.334542 0.283340 0.025277 -0.081969 -0.072922 0.012604 0.019849
polarizability: 2.35809647e+02 1.32143126e+01 1.93029682e+02 3.09387041e+00 3.48839593e+00 6.41229698e+01
1716.lowfreq: -4.9380 -0.0011 0.0009 0.0011 4.5563 6.0863 49.6978 64.5819 117.1180
frequency: 49.6813 64.5721 117.1156 125.8783 143.0772 148.2735 188.4630 199.6469 272.5353 284.3646 313.7598 338.6134 372.0466 404.0322 419.5980 440.8416 469.3570 538.9309 544.3425 631.4917 685.1603 693.8455 724.5184 772.9390 785.9353 803.3498 813.9510 839.9248 851.5508 932.2954 938.1769 983.8377 995.3904 1000.4139 1013.5320 1031.7707 1082.5784 1092.3073 1110.6514 1114.5552 1129.9283 1137.1574 1159.4077 1172.5925 1244.6607 1273.8156 1290.8355 1399.7536 1418.6735 1438.9140 1461.4397 1470.0787 1481.2301 1527.4084 1551.4762 1582.8970 1601.6788 1610.3960 3086.1026 3094.0412 3138.5096 3153.0328 3163.8858 3173.4632 3189.9777 3205.5112
redmass: 5.6996 9.8105 2.4392 4.8217 4.9430 4.8282 5.1917 10.4894 7.1751 7.1292 11.2040 6.9840 11.2433 6.0413 3.7390 4.9137 12.0427 7.5523 6.4494 7.0608 4.5521 7.6204 2.9685 4.9914 1.0784 1.7334 6.9504 7.4113 3.3045 1.7551 5.6219 4.4999 1.3924 1.1390 1.3614 2.1502 2.6586 1.6370 1.3940 1.3271 1.4774 2.1623 2.6169 1.0813 1.9699 4.9784 2.5885 10.0541 4.2133 2.4793 1.0756 2.6749 1.3513 10.0960 10.6572 8.9820 7.7334 8.0630 1.0490 1.0603 1.0863 1.0903 1.0946 1.1003 1.1189 1.1174
irintensity: 8.1765 1.1068 1.2512 1.1430 5.8051 2.7691 12.9587 1.0569 0.8245 7.3040 1.7875 4.1704 18.7239 0.1999 0.4787 5.3374 4.8013 6.7858 11.5010 14.6585 11.8841 0.7556 45.3883 23.5771 39.9302 41.4173 58.0952 1.8859 2.7306 0.3346 12.1725 51.7655 3.9421 6.1692 0.1529 0.3991 0.5428 2.0413 44.6163 0.8485 10.8382 19.7514 59.3899 5.1970 37.3943 314.9084 34.0445 1.0110 102.2214 3.9331 5.9380 3.7842 36.7575 120.6371 328.1330 228.6515 85.1661 119.9680 9.1700 31.9008 4.3276 5.1244 1.4787 26.0790 0.3652 18.4287
temp: 298.150 k
press: 1.00000 atm
elementType: 17 8 8 7 6 6 6 6 6 6 6 6 6 6 6 6 1 1 1 1 1 1 1 1
symmnumber: 1
zpe: 445550.2 jmol-1
zpe.correction: 0.169701 hartree
zpe.thermalcorrener: 0.183006 hartree
zpe.thermalcorrenthalpy: 0.183950 hartree
zpe.thermalcorrgfe: 0.129217 hartree
zpe.sumelectzpe: -1126.171023 hartree
zpe.sumelectthermal: -1126.157718 hartree
zpe.sumelectthermalent: -1126.156774 hartree
zpe.sumelectthermalfe: -1126.211507 hartree
dipole: -0.0987 -3.5132 1.1032
dipole: 3.6837
quadrupole: -70.9580 -110.9383 -99.2357
quadrupole: 3.6525 -2.2150 -1.5360
quadrupole: 22.7527 -17.2276 -5.5251 3.6525 -2.2150 -1.5360
hfenergy: -1126.3407242 hartree
pointgroup: C01 [X(C12H8Cl1N1O2)]
dipole: 0.1627398 -1.3656057 -0.45722 debye
dipolederiv: -0.4424347 -0.452918 -0.0174569 -0.3622995 -0.4600114 -0.0100619 -0.0157501 -0.007006 -0.0240421 -0.6684709 0.0653211 0.004823 0.2326855 -0.9500736 0.0212356 0.0059341 0.0335868 -0.2911368 -0.6746755 0.1757579 0.0078388 0.3511919 -0.9800642 0.0116684 -0.0253034 0.0277791 -0.3101241 -1.677224 0.8758402 0.1343113 0.5034856 -0.320454 -0.0806991 -0.3796339 0.2885695 -0.3810629 0.5128692 -0.1144952 -0.0085023 -0.0620722 0.035399 0.0303864 0.0387853 -0.0339505 0.2705383 0.4209257 -0.2279844 -0.0103356 -0.1838989 0.2465736 -0.0039888 0.0561573 -0.0397942 0.2658686 0.8456201 -1.0642629 0.0364003 -1.2180598 -0.1461855 -0.007296 0.2703811 -0.1987878 0.1482254 1.4026528 0.2962287 0.0089078 -0.064923 1.1775891 -0.0412271 0.0277729 -0.0323086 0.1477551 -0.5460375 1.0200337 0.0535873 1.3516075 0.3210198 0.0299197 0.0075351 0.0361711 -0.1660879 -0.7387461 0.0894187 0.0024797 0.1144813 -0.034278 0.0104374 -0.0197903 -0.0081548 0.0118491 -0.1660393 -0.2195695 0.0069115 -0.2788718 -0.1365309 0.0082663 -0.0010104 0.0109988 0.0167872 1.5737835 -0.4238514 -0.0186195 -0.3866841 0.8657673 -0.0358099 0.0408167 -0.0363466 0.1794359 -0.0278757 -0.1521999 0.0102604 0.0745945 0.078171 -0.0082719 0.0048829 -0.0077577 -0.0997334 -0.2538331 -0.0038088 0.0006777 -0.1897705 0.0735446 -0.0066082 0.0084505 -0.0046293 -0.1037388 0.0386688 0.1839179 -0.0038983 0.1137162 0.005504 -0.001301 -0.0021582 -0.0040162 -0.1509911 0.2257022 -0.0876921 0.0048987 0.0041069 -0.0056684 -0.003663 0.0027633 -0.0050036 -0.1342544 -0.0355161 -0.0302472 -0.0417112 -0.1327126 0.094145 0.0003166 -0.0681509 -0.0158707 0.0307022 -0.0099465 0.0344304 -0.0395793 0.0038812 0.0335415 0.0817949 0.0903972 0.0111888 -0.0408545 0.0085221 0.0200379 -0.0838028 0.0259457 0.0261798 -0.04393 0.0261117 -0.0952116 -0.0228527 0.0994163 0.020207 -0.042729 0.1087107 -0.0319178 0.0338541 -0.0611139 0.0656899 0.027836 0.1090792 0.0704848 -0.0032858 -0.0026749 0.0076837 0.0044279 -0.0006428 0.0039321 0.153846 0.1420744 -0.0219107 -0.0010171 0.0590897 0.0142255 0.0040856 -0.0025293 0.0039121 0.1560348 -0.0302245 -0.0958263 0.002451 -0.1112333 0.0051272 0.003907 0.0001689 0.0042947 0.1597191 -0.1082903 0.0430879 -0.0026097 0.0497037 0.080713 0.0025569 -0.0040739 0.0027148 0.1562809 unknown
polarizability: 238.048456|-8.7879282|190.8922981|-1.9945254|-1.2276506|64.0215444 unknown
InChI: InChI=1S/C12H8ClNO2/c13-9-10(14-5-6-14)12(16)8-4-2-1-3-7(8)11(9)15/h1-4H,5-6H2
charge 0 multiplicity 1
24 atoms
Cl 2.257423 2.513779 0.020507
O  0.601503 -2.413798 0.041972
O  -0.720839 2.933579 -0.116324
N  2.635529 -0.561931 0.146937
C  3.908014 -0.254823 -0.537898
C  3.370706 -1.69467 -0.439594
C  1.345907 -0.115767 0.017505
C  0.272685 -1.18793 0.023387
C  0.977333 1.22768 -0.020616
C  -1.146974 -0.745978 -0.001382
C  -1.477353 0.636456 -0.045482
C  -0.410353 1.699258 -0.064571
C  -2.175642 -1.720256 0.020169
C  -2.833752 1.031469 -0.068353
C  -3.527344 -1.320264 -0.002317
C  -3.855969 0.057443 -0.046789
H  4.733318 0.062049 0.106503
H  3.849814 0.251304 -1.508014
H  2.955467 -2.160918 -1.339239
H  3.81699 -2.390975 0.276914
H  -1.892907 -2.777069 0.054865
H  -3.058696 2.10183 -0.102311
H  -4.322287 -2.072999 0.01473
H  -4.905875 0.368827 -0.063798
