program: Gaussian 09
title: 000234951
version: EM64L-G09RevD.01
frameworkgroup: C1[X(C14H26O2)]
method: RPBEPBE
basis: SDD
operation: Freq
keyword: #pfreq=noraman
keyword: PBEPBE/SDD
title: #p freq=noraman PBEPBE/SDD
converged: YES YES NO NO
title: Mulliken charges:
elementType: O O C C C C C C C C C C C C C C H H H H H H H H H H H H H H H H H H H H H H H H H H
charge: -0.262695 -0.267630 0.361107 0.391830 -0.475576 -0.511828 0.008607 -0.405507 -0.414905 -0.437682 -0.437378 -0.439704 -0.392930 -0.745446 -0.726524 -0.740395 0.224474 0.199503 0.225719 0.213911 0.189883 0.208116 0.189819 0.193411 0.217455 0.182589 0.229325 0.230908 0.185978 0.193695 0.210361 0.245396 0.192759 0.211141 0.213506 0.210705 0.228422 0.222608 0.217843 0.215561 0.224301 0.219268
chargesum: 0.00000
title: Mulliken charges with hydrogens summed into heavy atoms:
elementType: O O C C C C C C C C C C C C C C
charge: -0.262695 -0.267630 0.361107 0.391830 -0.051600 -0.072197 0.198489 -0.007573 -0.004038 -0.025768 -0.020493 -0.035648 0.045226 -0.110095 -0.057651 -0.081266
polarizability: 1.85291410e+02 -1.09354870e+00 1.41739777e+02 1.35976585e+00 -1.04624926e+00 1.30713219e+02
1716.lowfreq: -19.2902 -10.2699 -0.0010 -0.0009 0.0003 18.4059 45.2754 55.6939 75.0675
frequency: 44.6549 55.2621 74.9438 95.5965 111.7371 164.0998 173.5720 188.9044 213.1781 219.2571 237.6917 240.8732 257.1772 288.7482 295.1561 300.8350 321.7034 374.3496 382.7603 404.7020 427.7119 445.8623 469.4366 480.7889 502.0818 516.5977 575.9197 631.1087 676.7123 724.8704 755.6760 767.2783 771.1110 784.6776 841.5516 897.8514 902.6902 910.3628 923.4682 931.7956 933.3069 953.0433 961.2684 978.7663 1001.2792 1010.8156 1022.2605 1033.3051 1049.8418 1054.3975 1063.1808 1072.6805 1088.0454 1094.4186 1147.3761 1152.6311 1165.1966 1176.9838 1196.2750 1202.9081 1231.7399 1248.5212 1257.7532 1261.5372 1275.6209 1283.4063 1299.7668 1304.8296 1312.5183 1324.3365 1331.8648 1340.6590 1342.4310 1349.4232 1352.4419 1364.8260 1369.0972 1383.2295 1386.5416 1392.6781 1445.9804 1452.7214 1454.1439 1462.2955 1466.7738 1468.0902 1474.1326 1475.2803 1476.5717 1479.8444 1481.4272 1484.8806 1487.3142 1491.3646 2933.2750 2938.3867 2944.9201 2962.5965 2964.6711 2973.8713 2977.6515 2979.9600 2981.9343 2984.3702 2992.2532 3004.3542 3011.0011 3031.0819 3040.4462 3042.2926 3049.6065 3060.8517 3062.7442 3064.6997 3066.0856 3070.3798 3073.1101 3074.1351 3076.2403 3079.8260
redmass: 3.1676 3.4555 2.1782 2.0444 2.7570 2.6757 2.1553 1.8050 1.1069 1.2112 2.5827 3.3107 1.8315 1.9638 2.3998 2.7533 2.1053 2.6829 2.2418 2.1276 2.0564 3.0028 3.2165 3.1817 3.3776 4.0306 2.7633 3.6830 4.2177 2.7027 1.3253 2.2395 1.5318 1.2790 2.2545 1.9270 2.5079 2.0886 1.7960 1.6308 1.7507 4.5276 1.4802 2.5613 1.5724 1.8776 1.6383 2.4437 2.3416 2.8601 1.9708 2.2084 1.3429 2.5392 1.6765 2.3685 2.2527 1.8866 2.3034 1.8993 1.1692 1.4130 1.3335 1.4268 1.5422 1.1954 1.3953 1.2602 1.3622 1.5072 1.3410 1.4988 1.7104 1.3995 1.5318 1.5490 1.3294 1.2263 1.2193 1.2044 1.0845 1.0879 1.0838 1.0658 1.0818 1.0733 1.0724 1.0571 1.0570 1.0693 1.0528 1.0476 1.0520 1.0681 1.0684 1.0829 1.0681 1.0598 1.0363 1.0586 1.0394 1.0529 1.0592 1.0451 1.0620 1.0635 1.0991 1.1002 1.1002 1.0955 1.1010 1.0992 1.0946 1.0992 1.0959 1.0975 1.1014 1.0992 1.0988 1.1001
irintensity: 0.1266 0.1405 0.1698 0.1027 0.0720 1.0284 0.8581 0.5619 0.2767 0.1088 2.3452 2.8636 1.0066 1.9560 1.5681 4.7545 0.3756 0.4771 1.6838 1.5987 3.1413 0.8633 10.4439 6.0311 1.0828 2.3673 5.8427 1.1489 2.9387 1.6605 4.6235 10.0776 1.3638 13.0413 38.8193 3.3970 17.0080 1.0743 2.0555 3.0245 13.7717 18.8387 8.3385 3.2406 12.6876 55.3119 17.8832 28.6836 21.4974 101.3736 59.2965 1.9000 1.9907 15.3432 8.4429 11.1992 1.4438 5.7915 2.4350 6.1405 2.3549 24.0102 5.6514 5.6674 2.1159 3.3686 0.6695 9.2089 0.3024 7.6978 1.5145 0.7771 4.6736 0.8910 0.2089 13.9983 13.5693 9.0812 17.5622 17.5556 6.6965 7.0230 17.3507 3.0240 8.6810 2.8891 5.7176 11.7434 7.2534 32.6810 2.7811 8.6922 9.1331 4.7098 38.6133 22.5812 53.1945 54.2185 31.0234 42.8841 36.2583 2.9057 57.9530 44.9863 25.3628 12.8553 28.6822 41.5015 21.9019 0.9433 40.4118 73.3270 12.8421 43.6059 46.4608 42.1835 43.6655 61.1704 45.9949 46.8471
temp: 298.150 k
press: 1.00000 atm
elementType: 8 8 6 6 6 6 6 6 6 6 6 6 6 6 6 6 1 1 1 1 1 1 1 1 1 1 1 1 1 1 1 1 1 1 1 1 1 1 1 1 1 1
symmnumber: 1
zpe: 988088.6 jmol-1
zpe.correction: 0.376343 hartree
zpe.thermalcorrener: 0.393647 hartree
zpe.thermalcorrenthalpy: 0.394591 hartree
zpe.thermalcorrgfe: 0.332726 hartree
zpe.sumelectzpe: -698.217740 hartree
zpe.sumelectthermal: -698.200436 hartree
zpe.sumelectthermalent: -698.199492 hartree
zpe.sumelectthermalfe: -698.261358 hartree
dipole: 0.8685 -1.6833 0.7487
dipole: 2.0367
quadrupole: -95.1545 -101.3344 -101.5656
quadrupole: -2.2539 -1.0015 -1.9897
quadrupole: 4.1970 -1.9829 -2.2141 -2.2539 -1.0015 -1.9897
hfenergy: -698.5940834 hartree
pointgroup: C01 [X(C14H26O2)]
dipole: 0.3424654 0.6394619 -0.340435 debye
polarizability: 185.2951495|0.9602543|141.5351603|-1.3939674|-1.812511|130.9140959 unknown
InChI: InChI=1S/C14H26O2/c1-4-13(5-2)10-15-14(16-11-13)8-6-12(3)7-9-14/h12H,4-11H2,1-3H3
charge 0 multiplicity 1
42 atoms
O  0.277002 -1.278646 -0.962109
O  -0.213456 0.204223 0.887799
C  -0.774354 -0.491756 -0.289064
C  2.106353 0.207165 -0.077274
C  -1.465091 0.498578 -1.260951
C  -1.767568 -1.521118 0.26429
C  -3.710776 0.122649 -0.072083
C  -2.693548 1.166774 -0.599702
C  -3.00107 -0.848511 0.906327
C  1.470912 -0.488607 -1.314548
C  0.965663 1.035485 0.580419
C  3.219507 1.166964 -0.593822
C  2.630016 -0.840521 0.950174
C  -4.927224 0.805074 0.588186
C  3.986982 1.950766 0.49542
C  3.785575 -1.742584 0.466005
H  -1.779715 -0.082662 -2.149546
H  -0.760499 1.273265 -1.616028
H  -1.231298 -2.149936 0.996628
H  -2.072839 -2.172856 -0.576245
H  -4.069353 -0.471238 -0.942376
H  -2.353908 1.793239 0.249645
H  -3.185446 1.841311 -1.328247
H  -3.71039 -1.627852 1.247137
H  -2.678691 -0.284379 1.803406
H  1.218511 0.274422 -2.083094
H  2.160403 -1.218977 -1.769591
H  1.27032 1.43964 1.560425
H  0.682731 1.885643 -0.079576
H  2.758947 1.89245 -1.297438
H  3.944395 0.580995 -1.194007
H  1.772644 -1.471739 1.248477
H  2.950232 -0.302718 1.865388
H  -5.446432 1.477825 -0.120266
H  -5.660392 0.05853 0.947152
H  -4.609658 1.411228 1.458622
H  4.524532 1.273979 1.183311
H  3.311563 2.581617 1.101366
H  4.736553 2.618393 0.032566
H  4.683746 -1.159656 0.189518
H  3.49366 -2.353366 -0.407612
H  4.08086 -2.444792 1.267116
