program: Gaussian 09
title: 000234946
version: EM64L-G09RevD.01
frameworkgroup: C1[X(C15H22O2)]
method: RPBEPBE
basis: SDD
operation: Freq
keyword: #pfreq=noraman
keyword: PBEPBE/SDD
title: #p freq=noraman PBEPBE/SDD
converged: YES YES NO NO
title: Mulliken charges:
elementType: O O C C C C C C C C C C C C C C C H H H H H H H H H H H H H H H H H H H H H H
charge: -0.255991 -0.242492 0.328118 -0.012776 -0.389436 0.036014 -0.757040 -0.728256 -0.768835 -0.455230 -0.561233 0.499957 -0.418878 -0.399289 -0.227127 -0.231121 -0.244592 0.184515 0.230444 0.186818 0.178222 0.223982 0.211363 0.217176 0.211914 0.200231 0.258623 0.240425 0.234314 0.214107 0.238923 0.228668 0.192885 0.240674 0.229094 0.236523 0.221652 0.222030 0.225622
chargesum: 0.00000
title: Mulliken charges with hydrogens summed into heavy atoms:
elementType: O O C C C C C C C C C C C C C C C
charge: -0.255991 -0.242492 0.328118 0.171739 0.027825 0.214236 -0.104518 -0.057489 -0.079989 0.012361 -0.127673 0.499957 -0.189784 -0.162766 -0.005475 -0.009091 -0.018970
polarizability: 2.15535099e+02 8.87109195e+00 1.43271439e+02 1.15299802e+01 -1.44964630e+01 1.33747555e+02
1716.lowfreq: -4.6518 -0.0005 -0.0004 0.0003 4.4392 14.3707 19.3021 32.9862 43.7970
frequency: 18.8377 32.8791 43.7592 65.8465 94.1259 127.0361 161.9181 182.8508 201.3865 209.4104 214.7490 248.7915 271.2351 273.5148 297.8909 328.0932 338.2739 379.0591 403.5353 416.3829 444.5248 472.2276 501.6753 530.9693 564.8417 581.5252 618.1979 652.3656 705.5553 725.3518 751.6672 761.2060 805.4834 835.3338 839.8629 853.8337 874.1554 914.4407 917.3114 940.6612 946.5306 974.4182 974.9017 989.8108 992.1041 998.8418 1010.8851 1023.5125 1026.2967 1036.6807 1043.2939 1079.5117 1091.6204 1104.9435 1137.2107 1171.0481 1174.7463 1186.3347 1188.0780 1213.4274 1218.6969 1222.0332 1263.2222 1274.0821 1279.6775 1301.4220 1325.2588 1330.7308 1338.5521 1340.8693 1354.9393 1376.9998 1380.2739 1382.7862 1390.0444 1399.0278 1441.2362 1452.1863 1455.2186 1462.7677 1463.9087 1466.6258 1482.3130 1483.0046 1485.7086 1486.5447 1489.0717 1593.4077 1614.6734 2859.7276 2894.7093 2920.2730 2968.4635 2982.6559 2984.7545 2998.6416 3013.1772 3046.7419 3056.5960 3065.4657 3070.6903 3075.9422 3081.2197 3095.5883 3098.6609 3101.7916 3111.7941 3114.8505 3129.9501 3141.4222 3160.5394
redmass: 3.6418 3.8629 4.1434 3.1316 3.3467 3.4509 1.1668 1.6923 2.8752 2.3218 1.2661 1.6962 2.4675 2.2746 3.2109 2.4546 2.4956 2.3137 2.8190 2.6270 4.7408 3.0593 3.4020 3.7456 3.2197 4.4088 6.3610 3.8256 1.7185 3.2188 1.6767 1.9364 3.4187 1.9766 2.5988 1.2680 2.2095 1.6781 1.6163 1.4015 5.3285 1.5856 1.3945 6.2353 1.3121 1.6613 2.8800 2.1316 2.2885 2.2458 2.2679 1.6883 2.0369 1.8940 1.8538 1.0652 1.8449 1.1272 1.9461 1.6080 2.3435 2.3723 1.3293 1.3936 1.3348 1.3507 1.2856 1.3299 1.4314 1.2741 1.2917 1.2758 1.5691 5.8730 1.3542 1.2147 2.1859 1.0829 1.0876 1.0503 1.0486 1.0578 1.0634 1.9671 1.1944 1.0538 1.0584 6.0751 6.1900 1.0824 1.0819 1.0684 1.0363 1.0367 1.0623 1.0360 1.0599 1.0981 1.0987 1.0969 1.0972 1.0982 1.1035 1.0992 1.0989 1.0998 1.0869 1.0867 1.0908 1.0959 1.1015
irintensity: 0.0174 0.2819 0.5822 0.2789 0.2810 0.3519 0.0261 1.2334 0.2389 2.1544 0.1328 3.0407 1.9057 1.9919 3.4812 0.3244 1.0134 1.5187 0.0056 3.9639 4.2305 3.1652 15.7661 0.7187 9.9473 4.1216 0.1194 6.5358 53.6328 2.7126 3.1458 37.4750 13.8985 19.1716 18.0447 1.3488 12.2351 1.4306 24.2901 4.8189 46.4291 18.5904 0.9247 0.3547 0.2732 4.1184 67.9498 44.7176 21.5223 8.5192 13.2513 0.9029 104.5761 49.3755 12.3255 0.8877 19.2306 0.3392 5.4772 3.5569 0.1047 4.2759 4.6121 2.4057 2.8412 26.1804 2.3251 8.7351 6.6981 12.4562 1.2742 14.1971 40.0305 2.7965 22.1628 25.1325 6.7627 4.7066 3.6265 7.9169 1.2192 19.1222 6.9759 29.4940 7.0570 16.8098 8.9682 1.2766 12.9559 61.8461 44.9187 95.7665 38.6580 26.5264 27.1126 20.2315 17.4278 3.1365 20.5109 8.0566 53.5313 50.2617 23.8881 16.0747 32.7466 21.2187 10.4778 6.5738 11.6576 48.1493 26.5009
temp: 298.150 k
press: 1.00000 atm
elementType: 8 8 6 6 6 6 6 6 6 6 6 6 6 6 6 6 6 1 1 1 1 1 1 1 1 1 1 1 1 1 1 1 1 1 1 1 1 1 1
symmnumber: 1
zpe: 882209.4 jmol-1
zpe.correction: 0.336016 hartree
zpe.thermalcorrener: 0.353352 hartree
zpe.thermalcorrenthalpy: 0.354296 hartree
zpe.thermalcorrgfe: 0.289815 hartree
zpe.sumelectzpe: -733.921266 hartree
zpe.sumelectthermal: -733.903930 hartree
zpe.sumelectthermalent: -733.902986 hartree
zpe.sumelectthermalfe: -733.967467 hartree
dipole: -2.3400 0.3062 -1.3222
dipole: 2.7051
quadrupole: -91.4068 -103.1760 -102.4686
quadrupole: 2.4626 4.4639 -5.0552
quadrupole: 7.6103 -4.1589 -3.4514 2.4626 4.4639 -5.0552
hfenergy: -734.2572818 hartree
pointgroup: C01 [X(C15H22O2)]
dipole: 0.9223752 -0.0878569 -0.5236468 debye
polarizability: 216.4892578|6.7371325|138.2467718|-8.7468462|15.7588239|137.8180632 unknown
InChI: InChI=1S/C15H22O2/c1-12-15(2,3)11-16-14(17-12)10-9-13-7-5-4-6-8-13/h4-8,12,14H,9-11H2,1-3H3
charge 0 multiplicity 1
39 atoms
O  1.767713 -1.272791 0.24773
O  1.398015 1.037498 -0.334504
C  3.75306 0.239814 0.052402
C  3.201184 -1.21319 -0.151217
C  2.80536 1.182645 -0.74621
C  0.958534 -0.345836 -0.536814
C  5.170013 0.363893 -0.558117
C  3.760323 0.64618 1.544583
C  3.89685 -2.321658 0.639621
C  -0.48838 -0.466275 -0.076279
C  -1.452666 0.40971 -0.920814
C  -2.890827 0.302154 -0.435693
C  -3.80848 -0.585694 -1.053762
C  -3.336131 1.06449 0.676034
C  -5.133036 -0.712596 -0.575648
C  -4.658411 0.94213 1.158092
C  -5.562834 0.051014 0.533979
H  3.257798 -1.437848 -1.244664
H  3.055528 2.241703 -0.565038
H  2.894181 0.969027 -1.837049
H  1.087256 -0.591928 -1.622613
H  5.910002 -0.21204 0.025265
H  5.199443 -0.000365 -1.60339
H  5.500218 1.420202 -0.559298
H  4.466288 0.026925 2.126716
H  4.072982 1.701922 1.653506
H  2.753764 0.53824 1.982389
H  3.782272 -2.158853 1.724379
H  3.440021 -3.295567 0.3936
H  4.972879 -2.371627 0.397629
H  -0.536134 -0.16992 0.987208
H  -0.783047 -1.529839 -0.135858
H  -1.388052 0.097016 -1.981947
H  -1.098925 1.455594 -0.868555
H  -3.48282 -1.178401 -1.918292
H  -2.641143 1.761669 1.161147
H  -5.828233 -1.401973 -1.068758
H  -4.984938 1.541758 2.015695
H  -6.589524 -0.04398 0.905342
