program: Gaussian 09
title: 000234913
version: EM64L-G09RevD.01
frameworkgroup: C1[X(C9H6Cl6S)]
method: RPBEPBE
basis: SDD
operation: Freq
keyword: #p
keyword: freq=noraman
keyword: PBEPBE/SDD
title: #p freq=noraman PBEPBE/SDD
converged: YES YES NO NO
title: Mulliken charges:
elementType: Cl Cl Cl Cl Cl Cl S C C C C C C C C C H H H H H H
charge: 0.016905 0.037942 0.062460 0.061617 0.068868 -0.059950 0.185293 0.834575 -0.881538 -0.356778 -0.307811 -0.561437 -0.081158 -0.079880 -0.097591 -0.544947 0.294781 0.306712 0.270537 0.281368 0.275580 0.274453
chargesum: 0.00000
title: Mulliken charges with hydrogens summed into heavy atoms:
elementType: Cl Cl Cl Cl Cl Cl S C C C C C C C C C
charge: 0.016905 0.037942 0.062460 0.061617 0.068868 -0.059950 0.185293 0.834575 -0.280045 -0.356778 -0.307811 -0.009531 -0.081158 -0.079880 -0.097591 0.005086
polarizability: 2.22443330e+02 7.62039737e+00 2.07236833e+02 2.14680520e+01 -2.60809315e+00 1.06453183e+02
1716.lowfreq: -20.4202 -6.7416 -3.8562 -0.0017 0.0007 0.0019 6.8871 9.1853 31.0743
frequency: -18.7323 8.8612 31.0580 50.9828 65.2577 75.7690 82.0363 116.6410 127.3271 178.3052 205.1706 208.6204 215.4024 219.1774 260.6929 265.6313 307.5009 318.8613 328.5479 339.8418 352.7709 372.0305 461.4119 577.8164 584.9158 594.8765 622.3482 641.9699 672.6632 701.6319 708.0984 775.6546 782.8097 811.6473 887.7044 911.3314 959.7819 1063.7309 1064.5751 1102.1458 1158.3730 1216.8669 1230.6827 1239.9047 1263.9118 1296.4371 1327.5947 1340.2365 1354.1511 1437.7636 1456.6900 1460.9604 1520.8713 1545.8438 3044.7183 3056.1573 3064.4401 3119.7558 3132.0688 3153.3866
redmass: 1.9237 20.2047 19.3827 17.0569 24.0643 10.2113 19.5523 9.7116 5.8058 9.8399 29.3554 28.9097 23.0858 29.5150 6.9769 11.3135 26.0765 19.5181 12.3696 5.0166 9.0408 4.5255 8.9371 4.7769 10.5307 12.0329 12.9057 8.9925 7.9624 5.1792 9.7133 6.3242 1.1912 12.4955 1.8161 9.3276 1.3298 8.2038 4.5332 1.0440 1.1878 7.0954 1.2239 1.1878 1.1931 1.2115 7.5140 7.2764 10.2809 1.0938 1.0943 1.0957 9.8355 11.7257 1.0570 1.0588 1.0561 1.1093 1.1058 1.1120
irintensity: 0.3110 0.0414 0.1333 0.1146 0.2427 0.9229 0.5064 2.3142 3.3341 1.5996 0.1033 0.1189 0.2111 0.0978 4.0624 6.5010 0.1655 0.1450 0.0132 0.4272 0.4386 0.4538 20.2375 1.5286 11.4321 0.4898 50.6041 50.8450 12.8500 3.7453 23.3959 0.4080 7.2298 2.0333 28.8556 3.8984 0.7477 21.4560 18.4535 0.9195 18.0096 56.2863 12.8413 1.0841 1.7183 12.2630 143.0680 11.7994 63.1354 21.3553 8.9219 8.0556 0.3440 9.4373 3.3659 6.5552 14.4103 2.1487 1.1847 13.1415
temp: 298.150 k
press: 1.00000 atm
elementType: 17 17 17 17 17 17 16 6 6 6 6 6 6 6 6 6 1 1 1 1 1 1
symmnumber: 1
zpe: 331822.6 jmol-1
zpe.correction: 0.126385 hartree
zpe.thermalcorrener: 0.143565 hartree
zpe.thermalcorrenthalpy: 0.144510 hartree
zpe.thermalcorrgfe: 0.076810 hartree
zpe.sumelectzpe: -3503.772073 hartree
zpe.sumelectthermal: -3503.754893 hartree
zpe.sumelectthermalent: -3503.753948 hartree
zpe.sumelectthermalfe: -3503.821648 hartree
dipole: -0.1342 -0.9362 1.6613
dipole: 1.9116
quadrupole: -151.3207 -146.1136 -139.7994
quadrupole: -5.4642 4.2984 -0.0489
quadrupole: -5.5762 -0.3690 5.9452 -5.4642 4.2984 -0.0489
hfenergy: -3503.8984579 hartree
pointgroup: C01 [X(C9H6Cl6S1)]
dipole: -0.031202 0.3878869 -0.6436023 debye
dipolederiv: -0.2632944 0.2327138 0.181106 0.2019085 -0.3384168 -0.2042853 0.1468026 -0.2082934 -0.1659206 -0.0941197 -0.1453853 0.0337129 -0.1206815 -0.6121131 0.0320129 0.0239932 0.0443235 -0.0201604 -0.2578444 0.264675 0.1610758 0.298839 -0.3175693 -0.1890249 0.1948157 -0.1985265 -0.1024426 -0.0639287 -0.1652839 0.0059389 -0.225566 -0.6012691 0.0028703 0.0225988 0.02038 0.0135816 -0.5118346 -0.1428373 0.2571598 -0.1719645 -0.0473119 0.0792141 0.3202776 0.0838611 -0.1308475 -0.4595797 0.1801529 -0.1052919 0.3591761 -0.4369244 0.1408049 -0.1678581 0.1064854 -0.2224151 -0.4677997 0.0359663 0.0427719 -0.0199499 0.0010218 0.0925759 -0.0915546 0.0769344 -0.1729358 0.0519824 0.075234 0.0301431 0.0506469 -0.3251248 -0.0770208 0.0679267 -0.0555719 -0.1036386 0.4218553 0.0310413 0.0592466 0.084867 -0.082306 -0.008685 0.0280574 -0.0301051 0.1554153 0.2528353 -0.3401868 -0.2954087 -0.3845443 0.3511775 0.34819 -0.2530062 0.2913086 0.1920832 -0.0173016 0.2575537 -0.0367944 0.282682 0.8536211 -0.1253951 0.0152467 -0.0454063 -0.0593935 0.0133725 -0.1417573 -0.0212038 -0.2035252 0.096892 -0.0819873 -0.0118054 -0.073753 0.0876102 0.2499465 -0.5044135 -0.1616371 -0.5621266 0.3071136 0.3414804 -0.2181185 0.3398197 0.1208094 -0.1151928 0.2691957 0.121699 0.3910579 0.832479 -0.0573999 0.1406379 -0.058031 -0.1021959 0.6414281 0.2462926 -0.3622984 0.2387929 -0.1574719 -0.1688089 -0.4091475 -0.1727865 0.1806235 0.5076731 -0.2813136 0.1156516 -0.2301655 0.5109838 -0.1121895 0.1757904 -0.1555361 0.2675219 -0.0148003 0.0037805 -0.009258 0.0305759 0.0492384 -0.1210209 -0.0125331 -0.0447364 0.029627 -0.016924 0.0317553 -0.0519616 -0.035013 0.0323455 0.0809345 -0.0471233 0.035812 0.0821924 0.079025 0.0142101 -0.0406845 0.0363557 -0.0182075 -0.0482713 -0.0407481 -0.0431997 -0.0437575 -0.0087006 -0.0090841 0.0436549 -0.0057279 -0.0287511 0.0731425 0.0671905 0.0546869 0.0068082 0.0018475 0.0239938 0.0361672 -0.024093 -0.0199497 0.0672288 0.0863834 0.0705082 0.0139234 0.0713547 0.0636968 -0.0037894 0.0084555 -0.0494571 -0.0643652 -0.0378261 -0.038174 -0.0264886 unknown
polarizability: 216.5388218|-8.901351|209.9791727|-28.5101653|3.9970668|109.6153516 unknown
InChI: InChI=1S/C9H6Cl6S/c10-1-2-16-3-4-5(11)7(13)9(15)8(14)6(4)12/h1-3H2
charge 0 multiplicity 1
22 atoms
Cl 0.681072 -2.316357 -1.684224
Cl -0.285019 3.019965 -0.38613
Cl -2.962476 2.154936 1.14629
Cl -1.96609 -3.167587 -0.115882
Cl -3.792173 -0.944473 1.308816
Cl 5.500452 -2.135452 1.019412
S  2.78107 1.172351 -0.404108
C  0.102997 0.315881 -0.924355
C  1.373871 0.742674 -1.618893
C  -0.31102 -1.040012 -0.859891
C  -0.744302 1.273828 -0.304615
C  3.418426 -0.577836 0.013531
C  -1.926591 0.906343 0.373298
C  -1.488526 -1.43594 -0.184637
C  -2.297897 -0.457994 0.439407
C  4.836744 -0.42416 0.551028
H  1.746592 -0.030677 -2.304651
H  1.225762 1.681226 -2.174859
H  3.409582 -1.175185 -0.911395
H  2.753275 -1.038329 0.760081
H  5.532714 -0.028777 -0.202539
H  4.883837 0.169476 1.476216
