program: Gaussian 09
title: 000020536
version: EM64L-G09RevD.01
frameworkgroup: C1[X(C19H12O)]
method: RPBEPBE
basis: SDD
operation: Freq
keyword: #pfreq=noraman
keyword: PBEPBE/SDD
title: #p freq=noraman PBEPBE/SDD
converged: YES YES NO NO
title: Mulliken charges:
elementType: O C C C C C C C C C C C C C C C C C C C H H H H H H H H H H H H
charge: -0.210625 0.086736 0.217980 0.454610 0.204721 0.316217 0.401435 0.155263 -0.672339 -0.473000 -0.478911 -0.412197 -0.397165 -0.426274 -0.438931 -0.266317 -0.259114 -0.258703 -0.247304 -0.210696 0.282923 0.252340 0.242556 0.280466 0.277882 0.230717 0.243740 0.233726 0.233314 0.232410 0.233713 0.170827
chargesum: 0.00000
title: Mulliken charges with hydrogens summed into heavy atoms:
elementType: O C C C C C C C C C C C C C C C C C C C
charge: -0.210625 0.086736 0.217980 0.454610 0.204721 0.316217 0.401435 0.155263 -0.389416 -0.220660 -0.236355 -0.131731 -0.119283 -0.195557 -0.195191 -0.032591 -0.025800 -0.026293 -0.013591 -0.039869
polarizability: 3.56457614e+02 3.78169416e-01 2.58027414e+02 -4.60332407e+00 7.46857734e+00 8.58143658e+01
1716.lowfreq: -4.5630 -1.2940 -0.0004 0.0004 0.0006 5.7006 52.3031 77.4247 103.5136
frequency: 52.2984 77.4233 103.5104 118.0139 144.7003 178.3464 189.5292 215.6012 268.3575 283.1814 333.9475 364.4623 397.4693 417.9778 432.4658 447.7882 474.9678 515.8666 521.8312 535.7402 572.6495 583.0597 612.1800 621.6238 654.7605 679.5936 686.5682 744.6066 761.3654 763.6411 785.8568 809.0444 814.1330 828.2355 838.8207 878.1303 892.0888 935.7554 942.2619 955.9958 972.3750 980.5104 989.8556 996.1491 999.0114 1012.7821 1028.3464 1039.8295 1062.2784 1114.3223 1138.3320 1165.4229 1176.8054 1184.9219 1202.4000 1230.0766 1237.5810 1256.8286 1273.3916 1306.8309 1357.4994 1369.8486 1383.3963 1395.4955 1413.0742 1415.6383 1422.0827 1437.6055 1446.9614 1490.0412 1503.4185 1531.4432 1564.3641 1567.0668 1609.6174 1612.8982 1618.5284 1630.4283 2921.7049 3125.0201 3127.5610 3132.2962 3132.6209 3138.0007 3148.5937 3151.5409 3158.4685 3165.7795 3173.0010 3182.9639
redmass: 6.6108 4.1387 4.5460 3.8522 3.6007 4.7564 4.8248 4.6211 5.0795 4.7321 5.2436 5.6012 4.1053 4.5282 5.5194 3.5427 3.8284 6.2339 3.5261 4.8370 4.9935 3.3428 3.3716 6.5067 6.8878 5.8888 3.3919 4.8954 1.5403 1.4647 2.3800 2.3484 4.8177 3.9408 1.6656 1.8621 1.4512 1.6156 4.6935 1.4043 1.3934 1.5301 1.3866 1.7914 2.2377 1.8103 4.3774 2.2422 2.0950 2.4560 1.7184 1.2802 1.1014 1.0950 1.4146 1.9558 1.8062 1.7562 2.6996 1.7239 4.3561 2.5347 2.2610 3.8332 2.6072 2.8752 3.0385 2.4424 2.3454 3.9506 3.0636 4.1873 7.3228 7.2564 5.9717 6.0011 6.7425 6.7408 1.0840 1.0867 1.0866 1.0903 1.0865 1.0899 1.0903 1.0989 1.0960 1.0958 1.0984 1.0949
irintensity: 0.6281 0.6524 4.3840 2.2669 2.6860 4.6380 6.7383 0.4737 1.5028 0.3096 0.2813 0.8523 3.4106 3.4431 18.2938 4.2916 2.2044 3.7885 4.3544 0.8028 1.8621 14.0388 1.2977 6.1681 18.5198 1.0932 16.6859 11.3969 3.6920 86.0647 40.0531 1.6842 12.3574 15.0407 33.0473 5.9015 2.7353 13.3676 5.0264 5.2102 0.4181 5.2245 3.7932 9.1068 7.7496 8.8355 32.1968 2.4610 3.1434 5.7977 16.7101 4.7438 5.7998 1.0388 40.6608 2.2920 9.4486 27.1447 25.4524 0.0714 14.2333 10.4530 0.4622 6.3651 8.0065 27.8578 4.8366 22.7970 1.6376 21.7230 37.3178 11.1643 77.8944 283.2205 5.2857 6.7931 10.7540 16.3221 108.6974 1.8703 1.7553 0.1312 1.2318 9.7820 13.5579 24.6114 43.8153 17.4461 14.5262 16.5070
temp: 298.150 k
press: 1.00000 atm
elementType: 8 6 6 6 6 6 6 6 6 6 6 6 6 6 6 6 6 6 6 6 1 1 1 1 1 1 1 1 1 1 1 1
symmnumber: 1
zpe: 646754.2 jmol-1
zpe.correction: 0.246336 hartree
zpe.thermalcorrener: 0.260729 hartree
zpe.thermalcorrenthalpy: 0.261674 hartree
zpe.thermalcorrgfe: 0.205165 hartree
zpe.sumelectzpe: -805.142633 hartree
zpe.sumelectthermal: -805.128239 hartree
zpe.sumelectthermalent: -805.127295 hartree
zpe.sumelectthermalfe: -805.183804 hartree
dipole: 3.4168 2.9772 -0.2944
dipole: 4.5415
quadrupole: -109.6568 -107.1262 -120.6619
quadrupole: -16.0587 0.8822 3.1038
quadrupole: 2.8248 5.3554 -8.1802 -16.0587 0.8822 3.1038
hfenergy: -805.3889686 hartree
pointgroup: C01 [X(C19H12O1)]
dipole: 1.2911338 1.2240921 -0.1646348 debye
polarizability: 355.8929235|4.4798668|258.4162897|-11.0967149|4.4177639|85.9901806 unknown
InChI: InChI=1S/C19H12O/c20-12-15-11-14-10-9-13-5-1-2-7-17(13)19(14)18-8-4-3-6-16(15)18/h1-12H
charge 0 multiplicity 1
32 atoms
O  -4.094251 -2.713991 0.576871
C  0.330482 -0.15101 -0.051613
C  -0.740953 0.847744 -0.097126
C  -0.047381 -1.536045 -0.12191
C  1.757429 0.158792 0.055829
C  -2.11928 0.441233 0.11901
C  2.726315 -0.886593 -0.215522
C  -2.428548 -0.977561 0.246486
C  -1.415535 -1.914387 0.046463
C  0.945263 -2.561006 -0.340373
C  2.283063 -2.238033 -0.453083
C  -0.501732 2.218418 -0.446923
C  2.27137 1.419475 0.512406
C  -3.145924 1.439976 0.123709
C  4.125183 -0.592965 -0.174849
C  -1.52955 3.167374 -0.465933
C  -2.859126 2.783641 -0.138504
C  3.647097 1.672777 0.580289
C  4.587177 0.67373 0.195448
C  -3.791159 -1.486804 0.548303
H  -1.686732 -2.977043 0.064279
H  0.606727 -3.599089 -0.431905
H  3.032697 -3.008906 -0.664461
H  0.494904 2.519644 -0.775611
H  1.580906 2.181578 0.880112
H  -4.186248 1.152119 0.298366
H  4.835554 -1.394333 -0.409915
H  -1.312304 4.200691 -0.756759
H  -3.662913 3.527644 -0.137557
H  4.001857 2.640414 0.951457
H  5.661101 0.885567 0.231182
H  -4.574088 -0.727847 0.777336
