program: Gaussian 09
title: 000234888
version: EM64L-G09RevD.01
frameworkgroup: C1[X(C10H14N2S2)]
method: RPBEPBE
basis: SDD
operation: Freq
keyword: #p
keyword: freq=noraman
keyword: PBEPBE/SDD
title: #p freq=noraman PBEPBE/SDD
converged: YES YES NO NO
title: Mulliken charges:
elementType: S S N N C C C C C C C C C C H H H H H H H H H H H H H H
charge: 0.135387 -0.031823 -0.335746 0.007166 0.470621 -0.630629 -0.338806 -0.413726 -0.442186 -0.228230 -0.198931 -0.601312 -0.611850 -0.266050 0.276816 0.295352 0.296805 0.265156 0.213123 0.224365 0.221484 0.265342 0.263565 0.202028 0.263792 0.256427 0.216433 0.225428
chargesum: 0.00000
title: Mulliken charges with hydrogens summed into heavy atoms:
elementType: S S N N C C C C C C C C C C
charge: 0.135387 -0.031823 -0.038941 0.007166 0.470621 -0.058460 -0.073650 -0.200603 -0.442186 -0.003866 0.022553 0.129623 0.124803 -0.040622
polarizability: 2.13769574e+02 -6.92706586e+00 1.55761414e+02 1.81392742e+00 -6.15616809e+00 1.22206883e+02
1716.lowfreq: -3.5621 -0.0032 -0.0022 -0.0011 6.6573 17.0299 18.6107 40.5598 51.7637
frequency: 18.3042 40.5274 51.7568 58.1076 66.2326 74.5668 120.8979 141.3186 189.6742 226.3889 236.9902 290.0777 307.2514 323.0423 405.9791 408.9827 433.5184 454.7847 506.5845 507.1793 536.3858 556.9904 565.3407 587.5819 614.6995 695.5188 760.7811 774.4049 830.9347 845.8173 895.5348 928.4712 957.4100 962.6910 981.1986 985.3154 1025.2977 1044.5660 1088.7790 1091.1089 1119.8305 1134.9019 1146.2363 1170.9522 1194.7210 1223.8255 1243.4545 1256.3101 1301.7916 1336.5622 1366.8747 1386.9263 1422.9777 1436.2904 1441.1468 1462.6713 1463.6237 1465.6499 1474.6044 1488.3957 1500.6799 1515.7034 1600.3227 1619.5421 2979.9291 2988.5862 2989.4701 3060.1308 3071.9464 3108.6557 3110.5728 3121.7950 3122.3475 3129.7417 3134.7325 3143.7985 3165.3013 3548.8800
redmass: 4.1853 3.9722 1.7898 2.9546 1.3426 3.2829 2.0672 5.1163 5.1446 3.8168 3.1730 4.6363 3.2831 5.1367 5.2910 2.9946 3.7906 5.5000 3.4972 1.8530 6.5232 4.0369 2.0080 4.6494 6.4015 1.8868 1.7812 3.7707 1.2616 4.8356 1.4572 2.2158 2.8058 1.3761 5.7656 1.3143 2.2287 1.6160 1.6395 1.2324 1.3524 1.6661 2.7816 1.0499 1.1171 1.2568 1.8987 1.8450 1.7460 1.4170 3.1187 5.6100 1.1267 2.1942 1.0410 1.1240 1.1208 1.1252 1.0590 2.0856 1.2319 1.8834 4.8315 6.0005 1.0349 1.0687 1.0345 1.1008 1.1012 1.0877 1.1015 1.0986 1.0883 1.0999 1.0916 1.0959 1.1011 1.0764
irintensity: 2.8942 0.2068 0.0874 0.1950 0.1474 4.1721 0.4115 2.0446 10.8429 9.2646 3.6663 2.5171 11.4931 1.4283 22.2927 2.9652 12.8964 89.5522 42.5127 64.0224 6.8313 13.5421 60.1788 59.3873 1.7377 39.4822 84.4368 5.0369 0.9693 23.3658 7.3698 81.4053 67.3223 1.8457 4.1066 0.8175 3.2651 14.4480 12.8165 0.4255 0.9225 34.8690 84.2280 0.8107 5.7356 139.2469 41.7698 44.6576 90.6451 24.6970 128.6772 29.6613 11.2476 11.3783 4.8829 18.4155 15.5742 14.7250 3.5039 55.2399 180.3032 140.9638 11.5865 112.8786 26.4079 43.4038 42.3660 14.7271 21.8350 14.8369 3.4944 49.1575 1.2426 11.6320 13.7868 21.7509 31.6721 21.8872
temp: 298.150 k
press: 1.00000 atm
elementType: 16 16 7 7 6 6 6 6 6 6 6 6 6 6 1 1 1 1 1 1 1 1 1 1 1 1 1 1
symmnumber: 1
zpe: 586414.7 jmol-1
zpe.correction: 0.223354 hartree
zpe.thermalcorrener: 0.238890 hartree
zpe.thermalcorrenthalpy: 0.239835 hartree
zpe.thermalcorrgfe: 0.177791 hartree
zpe.sumelectzpe: -1294.034401 hartree
zpe.sumelectthermal: -1294.018864 hartree
zpe.sumelectthermalent: -1294.017920 hartree
zpe.sumelectthermalfe: -1294.079964 hartree
dipole: -1.3798 -1.6054 2.9842
dipole: 3.6588
quadrupole: -84.0954 -88.8841 -102.5590
quadrupole: -7.0144 -7.4049 4.0146
quadrupole: 7.7508 2.9620 -10.7128 -7.0144 -7.4049 4.0146
hfenergy: -1294.2577548 hartree
pointgroup: C01 [X(C10H14N2S2)]
dipole: -0.6087793 -0.2127014 1.2869506 debye
polarizability: 212.3129674|-9.7801462|150.3248849|6.0464367|-15.2694763|129.100019 unknown
InChI: InChI=1S/C10H14N2S2/c1-12(2)10(13)14-8-11-9-6-4-3-5-7-9/h3-7,11H,8H2,1-2H3
charge 0 multiplicity 1
28 atoms
S  -1.526717 -1.134135 0.727206
S  -2.018572 0.463554 -1.946402
N  1.175847 -1.788899 0.00138
N  -3.325626 0.855125 0.406845
C  1.987266 -0.631601 0.073656
C  -0.138867 -1.836579 -0.520586
C  1.580439 0.61169 -0.482588
C  3.257108 -0.729461 0.709092
C  -2.368455 0.160189 -0.290079
C  2.446518 1.723922 -0.410585
C  4.108011 0.391592 0.776347
C  -4.103038 1.901424 -0.296719
C  -3.603228 0.590196 1.83745
C  3.711237 1.628559 0.214781
H  -0.463823 -2.871322 -0.694208
H  -0.306082 -1.213624 -1.418228
H  1.487358 -2.584585 0.559901
H  0.601441 0.71823 -0.963166
H  3.576368 -1.686287 1.143165
H  2.122491 2.67643 -0.845528
H  5.083703 0.298056 1.266915
H  -4.60579 1.475623 -1.183033
H  -3.435789 2.706283 -0.653631
H  -4.852303 2.315766 0.395989
H  -2.685767 0.703979 2.442989
H  -3.987419 -0.436407 1.984672
H  -4.356819 1.307935 2.194796
H  4.373308 2.499248 0.266471
