program: Gaussian 09
title: 000234876
version: EM64L-G09RevD.01
frameworkgroup: C1[X(C16H19NO)]
method: RPBEPBE
basis: SDD
operation: Freq
keyword: #p
keyword: freq=noraman
keyword: PBEPBE/SDD
title: #p freq=noraman PBEPBE/SDD
converged: YES YES NO NO
title: Mulliken charges:
elementType: O N C C C C C C C C C C C C C C C C H H H H H H H H H H H H H H H H H H H
charge: -0.436871 -0.142291 -0.134281 -0.511003 0.421825 -0.425565 -0.648416 0.452089 -0.446177 -0.379425 -0.460222 -0.370012 -0.221350 -0.226049 -0.245248 -0.220036 -0.226488 -0.243837 0.208891 0.191869 0.226148 0.253795 0.204137 0.251031 0.191872 0.248924 0.238491 0.258820 0.233424 0.253343 0.224992 0.223983 0.345313 0.227662 0.226092 0.225915 0.228657
chargesum: 0.00000
title: Mulliken charges with hydrogens summed into heavy atoms:
elementType: O N C C C C C C C C C C C C C C C C
charge: -0.091558 -0.142291 0.074610 -0.092986 0.421825 0.032367 0.043410 0.452089 -0.207686 -0.120605 -0.226799 -0.116669 0.003641 -0.002067 -0.017586 0.006056 -0.000573 -0.015179
polarizability: 2.38938781e+02 4.21086306e+00 1.73485603e+02 -4.33530110e-01 2.60268683e+01 1.18144607e+02
1716.lowfreq: -6.4239 -0.0003 -0.0002 0.0004 3.8663 11.2406 18.3640 27.9519 37.2065
frequency: 18.0190 27.4984 37.1050 61.9813 86.3696 108.0050 137.4347 158.8094 195.4395 213.4588 234.9729 254.1730 273.7972 301.1992 309.7451 341.6116 372.2322 404.2824 405.5817 445.9489 484.1266 504.7620 533.7061 607.4510 616.3405 618.8835 635.0805 703.9518 707.0010 747.5259 765.5997 787.5327 808.1978 845.5695 856.1720 859.4254 913.2433 920.1166 937.5927 971.9366 979.6819 982.5706 989.5189 990.6386 994.1263 997.4135 999.8605 1019.7665 1025.9260 1030.8145 1063.0538 1078.4544 1080.9775 1115.8441 1142.8627 1155.7275 1168.8851 1170.6767 1178.1917 1180.7386 1192.5229 1209.5116 1238.8545 1249.8481 1266.1622 1294.5256 1317.3962 1326.0204 1338.1631 1359.8997 1381.1688 1384.7735 1388.0038 1431.4462 1439.4388 1443.5171 1464.7094 1474.9067 1477.5422 1477.7432 1479.7894 1488.0932 1593.0226 1595.1701 1611.0895 1614.5402 2822.8534 2854.9692 2877.8560 2964.3485 2998.8083 3046.0811 3096.2966 3102.1715 3112.9884 3113.6205 3123.2904 3123.9175 3136.4650 3136.6461 3147.5801 3147.7466 3161.9237 3162.7770 3575.7154
redmass: 4.0655 3.8775 4.3653 3.9302 3.5738 4.3255 3.0525 5.2992 1.8440 1.1605 4.3153 2.3764 2.8175 1.9885 3.7431 3.8852 2.1834 2.8322 2.8308 3.0606 3.1610 3.4550 3.2683 4.9382 6.3745 5.8397 5.1269 1.9671 1.8539 1.7002 1.8038 2.8072 4.0208 3.8718 1.2498 1.2532 1.5451 1.4924 1.7566 4.9686 1.4090 1.4214 5.3152 5.4556 1.6001 1.3403 1.5094 2.3028 2.1082 1.8907 3.1158 1.5367 1.5205 1.4167 1.7249 1.5830 1.0830 1.0606 1.1249 1.1195 2.3982 2.2968 1.5936 1.4468 1.8442 1.3828 1.2949 1.2687 1.2926 1.6196 1.2154 6.8495 3.7977 1.3228 2.1465 1.7837 1.0901 1.1144 1.0821 2.1700 1.5662 1.2943 6.1763 6.1636 6.1682 6.1506 1.0710 1.0798 1.0564 1.0698 1.0846 1.0732 1.0941 1.1012 1.0875 1.0868 1.0862 1.0860 1.0915 1.0912 1.0956 1.0953 1.1013 1.1014 1.0657
irintensity: 0.1148 0.0770 0.0917 1.5515 0.3225 1.0065 1.3293 1.8454 32.4004 0.5276 7.9013 16.0822 5.0720 60.6644 2.9441 21.0710 3.5002 0.3723 0.1726 2.0739 14.6292 2.1434 16.2702 1.0423 0.2501 0.8191 5.1034 22.2268 63.0763 63.4951 49.4672 5.9439 10.2451 5.5275 0.0308 0.1735 13.4113 6.3937 25.6982 65.2113 0.9301 3.8070 0.3650 0.2021 0.1770 4.2131 4.2321 30.1179 5.9389 38.5868 74.2725 1.5868 10.4368 15.4760 15.9356 24.5891 1.1213 0.2083 3.7278 0.4914 1.8410 2.1815 43.6022 7.6100 2.1812 20.1400 6.0310 4.1374 29.1642 6.3682 14.4008 3.8451 0.4199 14.9070 9.2140 13.2133 7.7135 5.4926 2.3652 26.4267 18.0667 0.8046 0.7549 1.1740 7.7449 5.3260 83.3888 53.2133 111.0028 44.1117 29.1660 21.3733 21.6214 27.2377 8.2706 6.6435 0.0919 0.0120 14.2341 18.6395 39.2581 30.4659 29.8580 23.6909 3.3960
temp: 298.150 k
press: 1.00000 atm
elementType: 8 7 6 6 6 6 6 6 6 6 6 6 6 6 6 6 6 6 1 1 1 1 1 1 1 1 1 1 1 1 1 1 1 1 1 1 1
symmnumber: 1
zpe: 812273.5 jmol-1
zpe.correction: 0.309379 hartree
zpe.thermalcorrener: 0.326408 hartree
zpe.thermalcorrenthalpy: 0.327353 hartree
zpe.thermalcorrgfe: 0.262629 hartree
zpe.sumelectzpe: -749.722546 hartree
zpe.sumelectthermal: -749.705516 hartree
zpe.sumelectthermalent: -749.704572 hartree
zpe.sumelectthermalfe: -749.769295 hartree
dipole: 1.0899 -1.2250 0.7409
dipole: 1.7993
quadrupole: -97.3082 -110.3008 -109.0347
quadrupole: 5.0557 -0.7871 7.9429
quadrupole: 8.2397 -4.7529 -3.4868 5.0557 -0.7871 7.9429
hfenergy: -750.0319248 hartree
pointgroup: C01 [X(C16H19N1O1)]
dipole: 0.4521091 -0.5400048 0.0714736 debye
polarizability: 238.2221457|6.8904047|143.157511|3.4134081|38.1981598|149.1893339 unknown
InChI: InChI=1S/C16H19NO/c1-17(12-14-8-4-2-5-9-14)16(13-18)15-10-6-3-7-11-15/h2-11,16,18H,12-13H2,1H3
charge 0 multiplicity 1
37 atoms
O  -0.912508 3.378448 0.644483
N  0.078782 0.201412 0.532041
C  -1.258315 0.863594 0.618825
C  1.261213 1.090135 0.626409
C  -2.349824 -0.069802 0.078491
C  -1.339687 2.216388 -0.146938
C  0.168097 -0.934378 1.480512
C  2.565287 0.386988 0.25201
C  -3.627788 -0.098271 0.689719
C  -2.126879 -0.853192 -1.081315
C  3.737853 0.584437 1.020043
C  2.63249 -0.431218 -0.904469
C  -4.666091 -0.893092 0.153357
C  -3.162553 -1.649121 -1.619602
C  -4.436919 -1.670883 -1.005588
C  4.96017 -0.017102 0.638567
C  3.849441 -1.036205 -1.285762
C  5.019893 -0.828753 -0.516798
H  -1.508765 1.112737 1.681997
H  1.3765 1.541428 1.647571
H  1.12462 1.919788 -0.094836
H  -2.396905 2.432324 -0.364923
H  -0.797563 2.14298 -1.114199
H  -0.66599 -1.632587 1.302023
H  0.123059 -0.60254 2.547432
H  1.113968 -1.479144 1.327481
H  -3.809075 0.502295 1.590399
H  -1.128775 -0.84534 -1.532783
H  3.695751 1.208592 1.92173
H  1.717424 -0.597571 -1.483954
H  -5.648052 -0.909862 0.639825
H  -2.977455 -2.252766 -2.515733
H  0.056962 3.325231 0.835293
H  -5.239959 -2.289805 -1.421592
H  5.859766 0.143648 1.243471
H  3.888175 -1.668012 -2.180614
H  5.965049 -1.29758 -0.812974
