program: Gaussian 09
title: 000234875
version: EM64L-G09RevD.01
frameworkgroup: C1[X(C15H17NO)]
method: RPBEPBE
basis: SDD
operation: Freq
keyword: #p
keyword: freq=noraman
keyword: PBEPBE/SDD
title: #p freq=noraman PBEPBE/SDD
converged: YES YES NO NO
title: Mulliken charges:
elementType: O N C C C C C C C C C C C C C C C H H H H H H H H H H H H H H H H H
charge: -0.464948 -0.345660 -0.196384 0.458734 -0.601343 -0.393977 0.458564 -0.380929 -0.448509 -0.383457 -0.374645 -0.236103 -0.227307 -0.243296 -0.237927 -0.229699 -0.240771 0.245025 0.290159 0.229055 0.221179 0.217740 0.208868 0.272300 0.237240 0.240964 0.225910 0.224409 0.224627 0.226940 0.350931 0.224106 0.222484 0.225720
chargesum: 0.00000
title: Mulliken charges with hydrogens summed into heavy atoms:
elementType: O N C C C C C C C C C C C C C C C
charge: -0.114017 -0.055501 0.048641 0.458734 -0.151109 0.032631 0.458564 -0.108628 -0.211269 -0.142494 -0.148736 -0.011694 -0.002680 -0.016356 -0.013820 -0.007215 -0.015051
polarizability: 1.98308894e+02 2.21678040e+01 1.58114357e+02 -2.07730315e+01 2.44443944e+01 1.33680232e+02
1716.lowfreq: -2.2521 0.0007 0.0008 0.0009 8.2115 13.7339 20.4304 33.3439 44.5639
frequency: 19.2375 33.3190 44.3606 58.0040 86.2115 114.6532 129.3570 185.5558 224.3992 246.1800 252.5015 309.0738 334.3413 350.1210 401.7238 407.4701 432.6887 472.3303 515.1857 538.3649 602.3772 615.9470 616.8013 618.4325 703.3804 709.4141 720.7687 753.4091 767.7446 793.6841 811.7796 854.0359 865.4977 887.8121 924.1936 930.9353 966.6999 974.5555 978.7424 987.3991 989.4114 990.1781 993.2706 1002.3071 1022.4878 1024.3384 1026.3856 1061.6618 1077.5890 1099.5466 1124.8658 1168.4559 1170.9998 1176.3698 1186.5524 1195.8369 1198.2737 1206.4234 1214.9479 1256.4044 1292.3595 1325.1834 1326.9537 1338.4169 1353.4759 1383.6048 1388.2786 1401.4563 1438.9417 1441.7721 1456.2955 1464.1512 1464.9991 1481.4954 1483.4257 1592.1204 1593.8846 1610.0360 1613.0747 2896.7549 2960.0126 2993.4227 3025.2592 3051.4975 3108.2468 3110.6288 3113.3550 3121.6235 3127.9161 3133.9165 3139.7820 3144.7502 3158.9504 3160.2617 3436.6025 3583.8066
redmass: 4.5196 4.3230 3.9083 4.8824 4.1287 3.7499 4.6623 3.7876 2.3911 1.7665 2.0121 4.3748 4.8956 2.3651 2.8086 2.8859 3.1685 3.5591 3.6914 3.1032 2.8530 5.4820 6.3084 4.8587 1.7297 1.8183 1.9340 1.9575 1.7934 3.3635 3.3218 1.2508 1.2493 1.8912 1.5294 1.4500 5.4826 1.4174 1.6778 1.4265 5.6559 5.1181 1.3113 1.3582 2.3114 2.2164 2.2436 1.7539 1.6381 1.7033 3.0696 1.0863 1.0546 1.1168 1.1274 1.6820 2.4781 1.2091 1.6015 1.2382 1.5845 1.2566 1.2437 1.2451 1.4392 6.9014 5.2564 1.4028 2.1399 2.1253 1.1663 1.1122 1.2426 2.0814 2.0491 6.0033 6.1745 6.0610 6.1602 1.0809 1.0550 1.0598 1.1086 1.1037 1.0873 1.0873 1.0866 1.0860 1.0905 1.0910 1.0957 1.0957 1.1013 1.1013 1.0742 1.0667
irintensity: 0.0204 0.4084 0.0394 0.7059 0.3619 1.1126 2.5210 5.1256 32.6468 45.8649 65.1909 0.4403 10.0886 2.0244 0.0970 0.1532 4.6976 10.7533 7.8450 23.7195 13.2679 9.1401 0.1034 19.1495 65.0286 47.1372 102.4884 46.2486 45.9019 17.2166 21.0357 0.0806 0.2955 10.4603 8.6264 6.7489 75.9124 0.4815 3.8801 0.2989 0.0777 0.5761 0.4320 8.3445 4.0263 13.7624 23.6544 4.4878 5.2421 22.9125 42.4577 2.2649 0.0496 3.0249 0.7996 15.6414 3.3403 8.9967 3.4358 2.9690 6.2783 4.1429 1.5593 2.0829 10.7819 0.1254 3.6350 0.4206 6.8860 12.2195 4.5136 2.2476 42.7176 7.7674 17.2743 0.7163 1.2911 4.0179 3.8122 32.5468 59.3629 43.3727 38.7238 21.3041 8.8651 13.6048 3.1994 0.4297 8.9033 14.6832 44.6979 30.4628 31.2516 28.0142 12.4967 3.8469
temp: 298.150 k
press: 1.00000 atm
elementType: 8 7 6 6 6 6 6 6 6 6 6 6 6 6 6 6 6 1 1 1 1 1 1 1 1 1 1 1 1 1 1 1 1 1
symmnumber: 1
zpe: 742532.3 jmol-1
zpe.correction: 0.282816 hartree
zpe.thermalcorrener: 0.298357 hartree
zpe.thermalcorrenthalpy: 0.299301 hartree
zpe.thermalcorrgfe: 0.237811 hartree
zpe.sumelectzpe: -710.514069 hartree
zpe.sumelectthermal: -710.498528 hartree
zpe.sumelectthermalent: -710.497583 hartree
zpe.sumelectthermalfe: -710.559073 hartree
dipole: -0.9638 0.9757 -0.9324
dipole: 1.6584
quadrupole: -95.0822 -89.6609 -98.1620
quadrupole: 0.8983 -0.5042 2.1045
quadrupole: -0.7805 4.6409 -3.8603 0.8983 -0.5042 2.1045
hfenergy: -710.7968842 hartree
pointgroup: C01 [X(C15H17N1O1)]
dipole: 0.4743379 0.4464864 -0.0370331 debye
polarizability: 184.0871963|-42.0006354|133.4135357|3.2472928|-10.2400142|172.6027507 unknown
InChI: InChI=1S/C15H17NO/c17-12-15(14-9-5-2-6-10-14)16-11-13-7-3-1-4-8-13/h1-10,15-17H,11-12H2
charge 0 multiplicity 1
34 atoms
O  0.636121 2.963511 -1.765215
N  0.061793 0.245344 -1.644251
C  0.788933 0.889945 -0.530164
C  1.736482 -0.079598 0.18068
C  -0.923026 -0.806499 -1.278026
C  1.606411 2.05562 -1.121431
C  -2.077568 -0.340978 -0.384439
C  2.47079 -1.042123 -0.557272
C  1.932769 0.007676 1.580788
C  -2.026592 -0.517909 1.022385
C  -3.204209 0.316903 -0.943231
C  3.387645 -1.896968 0.092983
C  2.853211 -0.84346 2.234493
C  3.585023 -1.798423 1.49114
C  -3.071554 -0.047232 1.851087
C  -4.251359 0.788429 -0.120852
C  -4.187349 0.608303 1.281612
H  0.101212 1.330173 0.231266
H  -0.347296 0.973792 -2.24722
H  -0.37462 -1.626681 -0.778832
H  -1.323285 -1.211524 -2.226534
H  2.32727 1.657622 -1.865445
H  2.156925 2.57295 -0.309987
H  2.290051 -1.116278 -1.635965
H  1.358675 0.742579 2.160026
H  -1.166972 -1.035998 1.466952
H  -3.261961 0.457143 -2.030773
H  3.947561 -2.640349 -0.486367
H  2.994895 -0.766826 3.318673
H  4.296091 -2.462396 1.995918
H  1.11739 3.701195 -2.214899
H  -3.017767 -0.195422 2.935953
H  -5.116961 1.289515 -0.569466
H  -4.999931 0.971164 1.921317
