program: Gaussian 09
title: 000234869
version: EM64L-G09RevD.01
frameworkgroup: C1[X(C10H20N2O3)]
method: RPBEPBE
basis: SDD
operation: Freq
keyword: #p
keyword: freq=noraman
keyword: PBEPBE/SDD
title: #p freq=noraman PBEPBE/SDD
converged: YES YES NO NO
title: Mulliken charges:
elementType: O O O N N C C C C C C C C C C H H H H H H H H H H H H H H H H H H H H
charge: -0.456561 -0.218578 -0.316575 -0.468870 -0.660630 0.265727 -0.434970 -0.372706 -0.370416 -0.357262 -0.717587 0.118892 -0.357082 -0.697193 0.269836 0.266594 0.221159 0.195218 0.207670 0.189802 0.199308 0.188556 0.186634 0.274678 0.215310 0.233440 0.336696 0.195901 0.197406 0.215658 0.209146 0.209255 0.390435 0.301860 0.339248
chargesum: 0.00000
title: Mulliken charges with hydrogens summed into heavy atoms:
elementType: O O O N N C C C C C C C C C C
charge: -0.066126 -0.218578 -0.316575 -0.132173 -0.019522 0.265727 0.052783 0.030182 0.018694 0.017928 0.005841 0.118892 0.036225 -0.063134 0.269836
polarizability: 1.34176271e+02 -1.39410163e+00 1.33868283e+02 -2.55525390e+00 2.29800393e+00 1.25477906e+02
1716.lowfreq: -7.1534 -5.6241 -0.0012 -0.0010 -0.0010 9.3936 25.6533 39.4536 47.5299
frequency: 25.4415 39.3701 47.3585 59.7982 70.3383 82.2050 106.1312 112.4951 137.4823 144.6565 182.8694 215.8055 226.5147 236.9934 259.0228 265.1899 278.3025 300.5551 330.0163 378.8305 403.8446 423.6519 464.9448 491.3099 523.6420 543.2389 557.3012 609.5629 634.0689 715.1611 723.3619 727.5834 739.4112 759.1332 796.8302 851.5424 887.9253 894.5056 934.7424 979.8565 990.1143 1013.3950 1025.6180 1034.6438 1048.3123 1069.4442 1080.8530 1081.6289 1104.3486 1124.5804 1162.0215 1190.2658 1205.1018 1235.5522 1247.2086 1274.7301 1285.6257 1286.2605 1295.7052 1313.0171 1327.4616 1340.6962 1351.0296 1354.3757 1376.6796 1389.7028 1451.6911 1460.7485 1462.5927 1464.4258 1471.9696 1476.8610 1480.7934 1484.9984 1487.9878 1498.8882 1597.3613 1642.6374 1671.5736 2950.8781 2954.2847 2961.1929 2968.9711 2971.1353 2988.0343 2997.4258 3000.8258 3004.3680 3020.1365 3037.3494 3067.2552 3070.0511 3073.5330 3100.3789 3121.0369 3523.8300 3536.3616 3546.7022 3700.9902
redmass: 4.9406 5.1016 1.6615 4.1664 3.8025 4.7145 3.9133 1.6594 2.6633 4.2918 3.1059 2.6439 1.1235 1.0955 4.5412 3.1828 1.1758 3.0339 4.1518 4.6052 3.5523 3.1716 1.1380 2.8048 3.4332 3.6059 1.2297 1.2834 3.9451 3.2726 1.1239 4.4136 1.4842 2.0791 1.5201 2.1820 1.7991 1.5077 2.1173 1.3544 2.6671 3.7886 2.5078 2.1670 2.2522 2.6442 1.5651 1.8856 2.5484 3.0915 1.9981 2.1556 1.8052 1.4141 1.3813 1.3383 1.1214 1.2354 1.1804 1.6560 1.4438 1.9284 1.4977 1.6594 1.2493 1.2177 1.0777 1.1299 1.0680 1.0827 1.0757 1.0430 1.0789 1.0549 1.0888 2.0523 1.3705 3.2021 8.8337 1.0589 1.0596 1.0604 1.0580 1.0377 1.0968 1.0366 1.0771 1.0794 1.1017 1.1040 1.1008 1.0992 1.1036 1.1000 1.1017 1.0643 1.0617 1.0607 1.1041
irintensity: 0.0367 5.2135 0.8945 2.9363 0.3124 15.8150 0.0083 0.1981 0.5343 6.2923 2.6976 0.1239 0.0068 0.2523 5.3839 0.7677 23.2847 2.3471 1.7267 0.9311 0.4188 2.3297 332.4884 2.6122 24.8405 19.9176 86.5271 120.3953 10.3738 72.5445 15.5530 0.4522 12.1200 5.6866 5.9200 3.2460 2.7948 1.8386 6.5421 11.1462 52.1329 27.1719 76.5833 100.3396 5.7078 1.6164 18.5561 2.8944 4.1232 17.8724 13.8371 14.4096 31.6367 6.6315 3.8936 1.1196 0.2085 2.4014 2.1925 93.3736 10.6703 42.7248 5.7735 0.9748 27.8304 11.3128 6.8442 65.8151 0.9760 6.5950 2.9762 11.8078 4.7725 16.7545 25.1413 469.5245 78.9559 223.1214 160.6294 2.7108 2.2607 20.2920 116.9419 31.2832 0.9627 17.5752 8.4533 15.2844 0.5636 86.2686 87.6547 54.8995 24.1832 24.4931 3.7900 27.1464 62.8364 36.7489 36.3043
temp: 298.150 k
press: 1.00000 atm
elementType: 8 8 8 7 7 6 6 6 6 6 6 6 6 6 6 1 1 1 1 1 1 1 1 1 1 1 1 1 1 1 1 1 1 1 1
symmnumber: 1
zpe: 781261.0 jmol-1
zpe.correction: 0.297567 hartree
zpe.thermalcorrener: 0.316141 hartree
zpe.thermalcorrenthalpy: 0.317085 hartree
zpe.thermalcorrgfe: 0.249517 hartree
zpe.sumelectzpe: -727.061501 hartree
zpe.sumelectthermal: -727.042927 hartree
zpe.sumelectthermalent: -727.041982 hartree
zpe.sumelectthermalfe: -727.109551 hartree
dipole: -0.7751 -0.0008 4.5114
dipole: 4.5775
quadrupole: -89.3535 -94.9682 -86.1449
quadrupole: -0.7972 -11.3103 3.9918
quadrupole: 0.8020 -4.8127 4.0106 -0.7972 -11.3103 3.9918
hfenergy: -727.3590676 hartree
pointgroup: C01 [X(C10H20N2O3)]
dipole: -0.306646 0.040023 -1.7741684 debye
polarizability: 134.1306918|1.3367338|133.7938897|2.5398157|2.5545623|125.5978783 unknown
InChI: InChI=1S/C10H20N2O3/c1-3-4-5-6-7-10(2,8(13)14)12-9(11)15/h12-13H,3-7,11H2,1-2H3
charge 0 multiplicity 1
35 atoms
O  -1.982986 1.668421 -1.744337
O  -1.532477 2.916145 0.156043
O  -1.755806 -2.403991 0.964602
N  -1.943858 -0.637361 -0.579985
N  -2.264613 -2.85974 -1.261418
C  -1.655387 0.454793 0.375803
C  -0.226353 0.321151 1.008978
C  0.933043 0.309875 -0.008056
C  2.298944 0.066969 0.673226
C  3.484048 0.066788 -0.318167
C  -2.726274 0.511608 1.506811
C  -1.708238 1.7981 -0.366695
C  4.848731 -0.18358 0.363552
C  6.030419 -0.175688 -0.630151
C  -1.973266 -1.97858 -0.214721
H  -0.230918 -0.61977 1.58796
H  -0.098741 1.161331 1.717497
H  0.97164 1.274726 -0.55661
H  0.755317 -0.480851 -0.763997
H  2.468195 0.846399 1.445419
H  2.268704 -0.903197 1.211073
H  3.315292 -0.709759 -1.09369
H  3.516871 1.039023 -0.853707
H  -2.6845 -0.432441 2.072908
H  -3.738729 0.626951 1.081046
H  -2.520579 1.361352 2.178644
H  -2.106516 -0.357667 -1.548771
H  5.013078 0.589345 1.142007
H  4.81619 -1.15669 0.89479
H  6.99301 -0.359344 -0.118145
H  6.104599 0.798433 -1.149907
H  5.903838 -0.95793 -1.402619
H  -2.001803 2.571168 -2.16159
H  -2.471851 -2.566697 -2.213573
H  -2.297424 -3.84799 -1.025823
