program: Gaussian 09
title: 000234863
version: EM64L-G09RevD.01
frameworkgroup: C1[X(C18H19N3O2S)]
method: RPBEPBE
basis: SDD
operation: Freq
keyword: #p
keyword: freq=noraman
keyword: PBEPBE/SDD
title: #p freq=noraman PBEPBE/SDD
converged: YES YES NO NO
title: Mulliken charges:
elementType: S O O N N N C C C C C C C C C C C C C C C C C C H H H H H H H H H H H H H H H H H H H
charge: 0.185896 -0.243793 -0.230430 0.007445 -0.320903 0.012446 0.224308 0.203756 0.507556 -0.512790 -0.341131 -0.437741 -0.306065 0.354607 -0.410282 -0.191417 -0.241924 -0.245609 -0.272674 -0.333002 -0.243998 -0.212734 -0.685533 -0.682406 0.302106 0.247704 0.221830 0.206108 0.214587 0.214637 0.208702 0.208984 0.242210 0.254486 0.227908 0.228226 0.294196 0.206936 0.231599 0.231655 0.204803 0.234925 0.234814
chargesum: 0.00000
title: Mulliken charges with hydrogens summed into heavy atoms:
elementType: S O O N N N C C C C C C C C C C C C C C C C C C
charge: 0.185896 -0.243793 -0.230430 0.007445 -0.026707 0.012446 0.224308 0.203756 0.507556 -0.210684 -0.093427 -0.215912 -0.306065 0.354607 -0.204174 -0.191417 0.187300 0.172078 -0.030464 -0.078516 -0.016090 0.015492 -0.015344 -0.007863
polarizability: 5.48573750e+02 -3.53821328e+01 2.79754427e+02 6.17400515e-02 -1.64440856e-02 1.09661185e+02
1716.lowfreq: -3.7221 -0.0017 -0.0008 0.0010 1.6266 4.2240 17.9060 23.3893 27.3544
frequency: 17.0094 23.3494 27.3487 51.5488 66.3440 87.1679 88.7608 99.1403 114.7961 123.6318 143.4338 156.7826 181.2332 195.1758 204.4539 205.0891 239.1172 247.3035 270.0864 280.8113 306.2085 312.2391 316.0040 357.3185 380.9662 404.5524 431.4889 463.8502 466.9911 479.1175 494.6144 522.5522 530.6298 562.2712 579.0485 583.2288 607.0716 626.3434 638.9780 672.5467 721.0905 727.3028 744.0095 752.6988 759.6664 782.0072 795.1505 823.7959 834.2913 857.6546 869.6813 885.9843 895.2843 901.7960 909.4753 937.7404 939.0849 978.6051 994.4507 1013.3070 1024.7993 1031.9062 1033.0988 1035.8535 1113.2827 1114.0603 1116.6039 1132.0340 1134.3716 1134.6335 1142.2145 1168.4433 1179.8009 1221.6142 1247.5821 1260.0702 1262.3188 1265.8570 1276.2362 1289.9813 1340.5363 1365.5825 1369.2098 1372.8263 1395.6154 1400.0975 1406.4461 1433.2231 1434.8966 1444.2690 1459.9267 1460.8969 1475.0411 1476.4764 1485.9918 1487.8183 1502.8870 1518.2782 1559.7598 1565.1369 1583.4449 1590.4503 1605.8699 1632.6761 2955.1397 2959.7083 2965.2478 2996.7610 2998.9813 3014.1788 3019.0407 3094.3483 3096.0107 3106.1606 3109.5459 3127.9598 3134.3912 3148.4975 3163.8266 3168.9370 3173.0081 3174.8444 3398.5025
redmass: 4.7417 5.3471 5.7835 4.9738 3.4286 4.5019 3.5324 4.0180 1.7554 1.8426 6.1453 5.9606 5.7595 4.4507 4.5950 3.2225 1.2209 1.2198 5.4119 4.6904 4.9103 5.4776 4.6445 3.8209 7.2979 4.8315 3.1955 5.7846 3.1260 9.9501 7.5263 3.7901 5.3951 1.5792 4.0036 5.9551 7.2640 3.8564 6.4363 7.0442 6.1699 2.7801 3.1510 4.4678 1.4897 5.3591 1.4382 1.1087 1.1112 1.3796 4.3966 4.9315 1.4278 3.4602 1.3752 1.3918 1.5574 1.3122 3.2997 3.0444 4.7692 2.7844 2.6082 3.8337 1.7283 2.2721 2.1934 2.2209 1.4412 1.4363 2.8150 1.1023 2.0199 2.0047 1.9036 3.1873 1.1398 1.1412 1.3369 2.2881 1.7558 1.4185 1.3852 3.8226 1.6162 1.3120 2.1647 5.2559 2.9816 2.7762 1.0393 1.0401 1.1658 1.0655 1.1682 1.0816 1.9179 1.6710 6.7961 6.4602 6.8545 6.0483 6.2086 9.9877 1.0553 1.0555 1.0868 1.0362 1.0364 1.1075 1.1075 1.0989 1.0988 1.1014 1.1013 1.0892 1.0854 1.0905 1.0956 1.0929 1.0916 1.0994 1.0753
irintensity: 0.0059 0.3782 0.6709 0.1964 6.3195 1.8758 5.2400 0.4534 1.7140 0.0084 0.5002 1.3498 0.0017 10.5044 3.0824 16.1308 0.1786 0.0001 5.1339 7.6120 4.4291 2.1836 2.2351 0.9912 11.7415 0.0369 8.9269 21.0119 1.5731 0.5371 0.6939 18.8022 1.5671 41.6905 9.7601 5.7894 1.5328 20.9472 44.2632 5.4449 29.9559 14.9280 0.1964 4.7088 88.8307 8.0460 40.3404 9.1408 0.2192 1.3155 29.3661 8.2059 3.7687 84.5999 16.6082 0.0427 37.9824 0.1058 29.8879 4.2660 106.8808 159.9347 31.8473 5.5282 124.9524 2.0388 4.4777 183.7288 2.4275 7.2524 356.9222 3.9125 102.0641 85.6071 1.3662 516.2375 0.0161 0.0341 3.2660 4.7507 61.4446 8.4097 8.9594 2.6953 47.1197 9.5359 19.5227 57.2497 22.9985 43.7011 8.2302 15.4321 76.1765 39.5966 88.1370 5.4899 173.8949 5.1053 22.4102 103.1517 343.6429 31.2598 106.0017 574.8018 57.8876 22.6752 67.9144 22.9868 34.3473 34.4022 31.3159 26.8046 27.8010 32.8943 33.6634 14.1569 2.0377 10.9419 24.4458 23.4690 7.9544 20.7253 32.2740
temp: 298.150 k
press: 1.00000 atm
elementType: 16 8 8 7 7 7 6 6 6 6 6 6 6 6 6 6 6 6 6 6 6 6 6 6 1 1 1 1 1 1 1 1 1 1 1 1 1 1 1 1 1 1 1
symmnumber: 1
zpe: 879487.9 jmol-1
zpe.correction: 0.334979 hartree
zpe.thermalcorrener: 0.358072 hartree
zpe.thermalcorrenthalpy: 0.359016 hartree
zpe.thermalcorrgfe: 0.280219 hartree
zpe.sumelectzpe: -1408.295975 hartree
zpe.sumelectthermal: -1408.272882 hartree
zpe.sumelectthermalent: -1408.271938 hartree
zpe.sumelectthermalfe: -1408.350735 hartree
dipole: 1.9895 -2.4873 -0.0022
dipole: 3.1851
quadrupole: -120.2833 -124.3003 -155.1220
quadrupole: -9.6061 0.0296 0.0025
quadrupole: 12.9519 8.9349 -21.8868 -9.6061 0.0296 0.0025
hfenergy: -1408.6309539 hartree
pointgroup: C01 [X(C18H19N3O2S1)]
dipole: -0.801242 -0.9628623 0.0344251 debye
polarizability: 549.4431503|29.9752389|278.4454925|-13.6714572|-2.4889024|110.1007194 unknown
InChI: InChI=1S/C18H19N3O2S/c1-3-22-15-10-9-13(11-16(15)23-4-2)12-19-21-18-20-14-7-5-6-8-17(14)24-18/h5-12,21H,3-4H2,1-2H3
charge 0 multiplicity 1
43 atoms
S  4.611953 -2.060344 0.007699
O  -3.634862 1.862075 0.223902
O  -5.708992 0.221819 0.306732
N  3.128098 0.226281 0.02674
N  1.840338 -1.824477 0.083894
N  0.601659 -1.204282 0.117906
C  -3.326852 0.500428 0.227473
C  -4.456804 -0.390614 0.272794
C  -1.810206 -1.437301 0.197345
C  -2.026212 -0.026951 0.190581
C  -4.238404 -1.786564 0.27955
C  -2.92612 -2.306795 0.241935
C  5.446761 -0.443254 -0.030488
C  4.479826 0.618986 -0.014226
C  -0.457922 -1.991965 0.15942
C  3.003168 -1.079452 0.042988
C  -2.501686 2.812105 0.175816
C  -6.900666 -0.651062 0.35356
C  6.828655 -0.188301 -0.070853
C  4.929769 1.960077 -0.039436
C  7.257522 1.160736 -0.095385
C  6.315098 2.221588 -0.079738
C  -3.105958 4.212906 0.180825
C  -8.115494 0.272045 0.37659
H  -1.145806 0.619722 0.155839
H  -5.086315 -2.475971 0.313917
H  -2.774353 -3.392739 0.247552
H  -0.372829 -3.098752 0.166847
H  -1.847517 2.647922 1.056325
H  -1.907546 2.628127 -0.7425
H  -6.909454 -1.309894 -0.539301
H  -6.856487 -1.28538 1.262944
H  7.559321 -1.002749 -0.083213
H  4.191422 2.767016 -0.027001
H  8.329604 1.382249 -0.126841
H  6.668348 3.258244 -0.099225
H  1.919087 -2.851643 0.090541
H  -2.302339 4.97097 0.147726
H  -3.76184 4.357088 -0.694472
H  -3.704935 4.374884 1.093032
H  -9.045181 -0.324623 0.4137
H  -8.084948 0.931652 1.260188
H  -8.1390 0.904989 -0.526482
