program: Gaussian 09
title: 000234861
version: EM64L-G09RevD.01
frameworkgroup: C1[X(C15H13N3OS)]
method: RPBEPBE
basis: SDD
operation: Freq
keyword: #p
keyword: freq=noraman
keyword: PBEPBE/SDD
title: #p freq=noraman PBEPBE/SDD
converged: NO YES NO NO
title: Mulliken charges:
elementType: S O N N N C C C C C C C C C C C C C C C H H H H H H H H H H H H H
charge: 0.183594 -0.226331 0.017271 -0.324466 0.089739 -0.305956 0.352998 0.353602 -0.189987 -0.272469 -0.332120 0.208042 -0.243908 -0.213101 -0.356454 -0.350174 -0.399675 -0.258933 -0.232015 -0.538536 0.242021 0.254507 0.227589 0.227904 0.219134 0.240527 0.185000 0.285870 0.230460 0.227810 0.218987 0.218987 0.260084
chargesum: 0.00000
title: Mulliken charges with hydrogens summed into heavy atoms:
elementType: S O N N N C C C C C C C C C C C C C C C
charge: 0.183594 -0.226331 0.017271 -0.038597 0.089739 -0.305956 0.352998 0.353602 -0.189987 -0.030448 -0.077613 0.208042 -0.016318 0.014803 -0.137320 -0.109647 -0.214676 -0.028473 -0.004206 0.159522
polarizability: 4.64909114e+02 2.47212044e+01 2.27184084e+02 -1.14288549e-02 6.27713344e-03 8.05577406e+01
1716.lowfreq: -5.5076 -3.4762 -0.0023 -0.0020 -0.0009 1.4320 17.5111 31.8034 34.6888
frequency: 17.4999 31.8016 34.6636 78.0641 104.3261 116.5686 141.4403 180.7940 189.2979 195.1942 207.2411 225.4329 255.6378 304.1185 306.4839 335.3145 364.6771 414.4216 430.1779 470.4506 472.8281 481.2359 521.9148 527.8485 551.6889 555.1663 574.4985 588.2099 609.0843 644.9920 672.9619 723.6110 726.9106 743.7074 753.8511 759.2997 765.7718 849.1893 857.2509 857.5873 900.5733 921.0361 937.8361 945.1930 973.4428 975.7660 977.7647 1004.6534 1017.9338 1035.9392 1048.5525 1109.5970 1111.4341 1124.6322 1138.2427 1152.3174 1168.6980 1175.9023 1232.3894 1238.7480 1249.4387 1268.7329 1290.3422 1357.1352 1372.4928 1397.6794 1420.0984 1435.5319 1440.1759 1444.2410 1466.0459 1471.0482 1489.6420 1517.2972 1563.6025 1564.9247 1582.8413 1586.6608 1603.4999 1634.3371 2928.2393 2961.4321 3051.5257 3117.7895 3134.1033 3134.4677 3137.4488 3148.3703 3160.3116 3164.1244 3173.4159 3175.3542 3367.0451
redmass: 5.2836 5.7795 5.4410 4.8617 3.2078 6.2093 5.2826 5.7474 2.7163 7.6525 2.4216 4.0162 1.5214 5.3175 5.0649 3.8149 7.0690 10.0183 3.1732 5.8701 3.0384 9.1413 5.9423 5.1278 6.4919 3.3218 3.7531 1.5226 7.9145 6.5957 7.0571 5.7032 2.7697 3.1941 1.3040 1.4924 6.3747 1.4677 1.3800 6.3871 6.3934 1.3972 1.3814 1.4799 1.3309 8.5712 1.3127 6.9572 2.7281 3.8824 2.2651 1.2595 1.8278 1.7591 2.6329 1.3780 1.0961 1.0801 3.3164 2.4688 1.8658 1.5436 2.3041 1.6943 4.0681 4.4771 1.6364 2.9596 1.4466 2.7997 1.1179 1.0506 2.1741 1.6366 5.4632 6.4564 7.3119 5.7469 5.8417 9.8243 1.0843 1.0330 1.1040 1.0881 1.0854 1.0986 1.0885 1.0906 1.0935 1.0958 1.0986 1.0991 1.0749
irintensity: 0.2121 0.9848 0.7004 0.3405 11.2934 2.9056 3.9493 0.0854 21.7901 1.0260 5.0271 2.6943 0.0081 0.3557 5.7420 0.2113 5.5897 17.6528 8.6502 3.0129 2.0822 1.1073 0.1725 8.6645 1.5767 1.3506 9.2099 58.6756 7.1625 29.0283 4.4670 11.8766 14.9722 0.8033 91.7993 93.6490 13.9699 1.9639 1.2840 18.1307 24.4488 7.1409 2.6843 25.9687 0.5842 36.9032 0.1241 82.2223 87.5784 5.3483 3.9374 0.1635 144.3402 43.1418 246.9534 1.2430 4.1032 3.3628 50.9921 48.9593 17.8623 30.6911 9.9305 9.3232 4.6657 22.6381 15.9833 15.2704 8.4327 35.6878 50.4004 13.5061 36.9635 55.3666 10.6177 133.7475 341.9171 17.4918 19.7021 550.0209 71.2330 66.4405 45.9733 11.0692 2.2406 11.4073 3.9774 11.3340 26.4781 25.0940 29.5979 19.2499 28.3433
temp: 298.150 k
press: 1.00000 atm
elementType: 16 8 7 7 7 6 6 6 6 6 6 6 6 6 6 6 6 6 6 6 1 1 1 1 1 1 1 1 1 1 1 1 1
symmnumber: 1
zpe: 649819.0 jmol-1
zpe.correction: 0.247503 hartree
zpe.thermalcorrener: 0.265062 hartree
zpe.thermalcorrenthalpy: 0.266007 hartree
zpe.thermalcorrgfe: 0.200094 hartree
zpe.sumelectzpe: -1215.481082 hartree
zpe.sumelectthermal: -1215.463523 hartree
zpe.sumelectthermalent: -1215.462579 hartree
zpe.sumelectthermalfe: -1215.528491 hartree
dipole: -2.3214 -0.4580 -0.0002
dipole: 2.3661
quadrupole: -98.6641 -99.8891 -131.3364
quadrupole: -2.6982 -0.0008 0.0009
quadrupole: 11.2991 10.0741 -21.3732 -2.6982 -0.0008 0.0009
hfenergy: -1215.7285854 hartree
pointgroup: C01 [X(C15H13N3O1S1)]
dipole: -0.9215225 0.1318371 0.0000879 debye
polarizability: 466.850114|-12.0808181|225.2430844|0.0110824|0.0068704|80.5577406 unknown
InChI: InChI=1S/C15H13N3OS/c1-19-13-8-4-2-6-11(13)10-16-18-15-17-12-7-3-5-9-14(12)20-15/h2-10,18H,1H3
charge 0 multiplicity 1
33 atoms
S  2.976043 2.265016 0.000183
O  -2.356724 -1.614172 -0.00011
N  1.975373 -0.270971 -0.000093
N  0.306481 1.489305 0.000004
N  -0.796113 0.647937 -0.000094
C  4.115514 0.846825 0.000094
C  3.378951 -0.386688 -0.000048
C  -3.272725 0.608005 -0.000147
C  1.592404 0.982717 0.00001
C  5.521085 0.870859 0.000151
C  4.086698 -1.611574 -0.000132
C  -3.492561 -0.813133 -0.000162
C  6.209564 -0.365888 0.000065
C  5.496747 -1.592969 -0.000075
C  -4.419323 1.453747 -0.000189
C  -4.81342 -1.329005 -0.000229
C  -1.966939 1.263968 -0.000082
C  -5.730619 0.941881 -0.000255
C  -5.923904 -0.457778 -0.000277
C  -2.527708 -3.070615 -0.00007
H  6.075777 1.81417 0.00026
H  3.522391 -2.548615 -0.000241
H  7.304737 -0.369791 0.000108
H  6.049288 -2.538713 -0.00014
H  -4.262667 2.540047 -0.000172
H  -4.981444 -2.40967 -0.000246
H  -2.02102 2.375662 0.000009
H  0.191629 2.514985 0.000078
H  -6.588059 1.621924 -0.000291
H  -6.9365 -0.875803 -0.00033
H  -3.064446 -3.413561 -0.905896
H  -3.064559 -3.413499 0.905714
H  -1.502753 -3.467203 0.000006
