program: Gaussian 09
title: 000234849
version: EM64L-G09RevD.01
frameworkgroup: C1[X(C11H8O3)]
method: RPBEPBE
basis: SDD
operation: Freq
keyword: #pfreq=noraman
keyword: PBEPBE/SDD
title: #p freq=noraman PBEPBE/SDD
converged: NO YES NO YES
title: Mulliken charges:
elementType: O O O C C C C C C C C C C C H H H H H H H H
charge: -0.211873 -0.435531 -0.233864 0.110382 0.374921 0.081608 -0.367483 -0.367502 -0.304083 -0.168370 -0.214331 -0.214325 -0.231970 0.077387 0.240831 0.240829 0.283947 0.265635 0.229834 0.229834 0.231150 0.382974
chargesum: 0.00000
title: Mulliken charges with hydrogens summed into heavy atoms:
elementType: O O O C C C C C C C C C C C
charge: -0.211873 -0.052557 -0.233864 0.110382 0.374921 0.081608 -0.126652 -0.126673 -0.020136 0.097265 0.015503 0.015509 -0.000821 0.077387
polarizability: 1.65212739e+02 -1.32065612e+01 1.07306855e+02 -3.44372415e-03 -1.43019029e-03 9.27755610e+01
1716.lowfreq: -52.1784 -10.7745 -0.0011 -0.0009 -0.0005 4.8416 8.5635 47.5254 64.8243
frequency: -52.1695 47.4889 64.8022 108.9493 168.3359 170.5148 282.8348 303.1176 365.6832 396.5338 402.5997 493.4330 557.6173 559.0846 605.3534 617.9201 641.7949 673.3911 684.7708 699.7427 737.1754 766.5703 766.9068 852.2293 871.4477 886.5798 924.6947 937.1012 977.5638 988.6093 993.3243 999.4862 1008.7273 1040.6739 1072.1120 1080.2915 1119.2917 1174.3306 1189.1753 1196.1401 1257.0250 1298.7249 1312.5334 1372.3666 1392.7888 1430.0752 1469.4232 1509.7650 1583.9008 1585.6547 1626.2760 1659.7644 3127.5976 3135.2113 3145.8522 3155.9266 3168.7004 3240.6198 3273.3078 3526.2023
redmass: 4.1955 10.0136 6.4624 4.7601 5.7182 5.8256 5.1917 7.2336 5.1959 2.8023 6.8498 5.5537 4.0190 1.6637 4.3596 2.3456 4.8625 6.3132 5.9515 1.7697 1.6573 1.8494 3.3267 1.2460 6.3757 1.3524 1.7192 3.5658 1.3921 6.1231 3.8989 1.3804 4.1577 2.0201 2.0946 1.6028 1.8738 1.0535 1.1144 1.5625 4.0738 2.1892 1.3575 7.0850 4.8628 2.2091 2.5155 5.0195 7.7646 5.9721 7.2351 8.7870 1.0847 1.0880 1.0928 1.0972 1.1019 1.0914 1.1097 1.0641
irintensity: 0.0256 1.5881 1.5891 1.1032 0.1728 0.5683 0.7558 0.7914 9.7641 0.0075 7.2973 9.0596 18.6078 47.4599 14.7964 65.3426 34.8547 11.6499 2.9595 47.0113 87.2423 73.9226 2.2509 0.0683 5.4719 9.8500 52.9738 109.7440 0.0192 1.1342 77.2625 5.7498 9.1626 16.2011 160.5016 8.6692 56.5309 0.0001 1.6146 18.7745 16.9564 44.8356 0.2170 0.4217 22.3137 9.4598 57.8953 3.7479 79.3415 1.0501 30.0433 239.8780 0.2997 0.7162 18.2390 32.7384 18.0426 1.9986 0.2173 41.4647
temp: 298.150 k
press: 1.00000 atm
elementType: 8 8 8 6 6 6 6 6 6 6 6 6 6 6 1 1 1 1 1 1 1 1
symmnumber: 1
zpe: 422868.6 jmol-1
zpe.correction: 0.161062 hartree
zpe.thermalcorrener: 0.171684 hartree
zpe.thermalcorrenthalpy: 0.172628 hartree
zpe.thermalcorrgfe: 0.123666 hartree
zpe.sumelectzpe: -648.651213 hartree
zpe.sumelectthermal: -648.640592 hartree
zpe.sumelectthermalent: -648.639648 hartree
zpe.sumelectthermalfe: -648.688609 hartree
dipole: -0.5960 0.7241 0.0002
dipole: 0.9379
quadrupole: -65.6390 -80.1272 -74.8981
quadrupole: -1.3513 0.0021 -0.0011
quadrupole: 7.9158 -6.5725 -1.3433 -1.3513 0.0021 -0.0011
hfenergy: -648.8122754 hartree
pointgroup: C01 [X(C11H8O3)]
dipole: 0.2381197 0.281863 0.000013 debye
dipolederiv: -0.5347206 0.0140512 -0.000005 -0.0154358 -0.7126623 -0.0001656 -0.0000763 -0.0001594 -0.1106311 -1.273441 0.4373374 0.0001005 0.4520541 -0.4481922 -0.0000742 -0.0003834 0.000031 -0.4286194 -0.7819947 -0.1655858 -0.0001948 -0.1250135 -0.9402837 -0.0001917 0.0003113 0.0002381 -0.2886631 0.8423085 -0.2382289 0.0000372 0.1269973 0.6662558 0.0001928 0.0002077 0.0001509 -0.0200112 0.0057638 -0.0249073 0.0000013 0.0175751 -0.0564637 -0.0000147 -0.0000396 -0.0000448 0.0358276 -0.2839638 0.2559929 0.0000614 0.2597554 -0.6955936 -0.0000879 0.0001171 -0.0003087 -0.0152252 -0.0892889 0.028623 0.1026031 0.0059327 -0.1036794 0.0117587 -0.0717223 -0.0022454 0.0552792 -0.0893137 0.0286637 -0.1026283 0.0060113 -0.1037124 -0.0118208 0.0717008 0.0021996 0.0552378 -0.0975638 0.0584642 0.0000036 0.0183078 0.032103 0.0000791 0.0000688 -0.0000207 -0.1703454 0.2093629 0.041271 0.0000267 -0.1277677 0.0482753 0.0001072 -0.0000264 0.0000496 -0.1379933 -0.0720577 0.0255407 -0.1178225 0.0234973 -0.1368206 -0.036829 -0.0719258 -0.0282209 0.0627964 -0.0721352 0.0254918 0.1177817 0.0234167 -0.1368397 0.0367594 0.0718902 0.028157 0.0628794 0.1070362 0.0715045 0.0000324 0.0686558 -0.1311704 -0.0000072 0.0000224 -0.0000044 -0.0243871 1.6864719 -0.2275078 0.0000536 -0.449699 1.7083321 0.0002336 -0.000053 0.0000206 0.2321352 0.0616802 -0.0276671 -0.0914313 -0.0204625 0.1334143 -0.0153127 -0.0844774 -0.0144783 -0.0302466 0.0616118 -0.0277037 0.0914594 -0.0204916 0.1334037 0.0153631 0.0844991 0.0145278 -0.0301859 0.0162207 -0.0041635 -0.0000121 0.0113739 0.1455134 -0.0000228 -0.0000064 -0.0000066 0.1921974 0.0590319 -0.0202927 -0.0000265 -0.0345091 0.0215968 -0.0000808 -0.0000429 -0.0000552 0.2148953 0.0132548 -0.0283806 0.0815279 -0.0378337 0.1497258 0.0225212 0.098731 0.0216566 -0.0659839 0.0133124 -0.0283479 -0.0815109 -0.037798 0.1497418 -0.0224567 -0.0987195 -0.0215926 -0.0660582 -0.1218103 -0.0656338 -0.0000444 -0.0706997 0.1422001 -0.0000021 -0.0000455 -0.0000014 0.0893732 0.3402347 -0.1285213 -0.0000129 -0.0738669 0.1348559 0.0000512 -0.0000299 0.0001069 0.3877289 unknown
polarizability: 165.5420511|12.4593595|106.9775408|0.0083919|0.0060353|92.7755632 unknown
InChI: InChI=1S/C11H8O3/c12-11(13)9-6-7-14-10(9)8-4-2-1-3-5-8/h1-7,12H
charge 0 multiplicity 1
22 atoms
O  0.806663 2.068239 0.000285
O  3.178304 -1.882881 -0.000415
O  0.893881 -2.332329 -0.000215
C  0.500915 0.693623 -0.000175
C  -0.931877 0.322852 -0.000444
C  1.700309 -0.024837 -0.000413
C  -1.626569 0.151268 1.223995
C  -1.626179 0.151683 -1.225163
C  2.791371 0.935805 -0.000035
C  2.218259 2.186916 0.00053
C  -2.99658 -0.188965 1.222567
C  -2.996188 -0.188556 -1.224291
C  -3.684433 -0.359273 -0.001001
C  1.822149 -1.488982 -0.000945
H  -1.091333 0.27736 2.171448
H  -1.090641 0.278104 -2.172403
H  3.84906 0.685605 -0.000128
H  2.598542 3.204153 0.000999
H  -3.52434 -0.323577 2.173022
H  -3.523645 -0.322846 -2.174961
H  -4.747246 -0.626043 -0.001214
H  3.213177 -2.877316 -0.000043
