program: Gaussian 09
title: 000234828
version: EM64L-G09RevD.01
frameworkgroup: C1[X(C16H23NO2)]
method: RPBEPBE
basis: SDD
operation: Freq
keyword: #p
keyword: freq=noraman
keyword: PBEPBE/SDD
title: #p freq=noraman PBEPBE/SDD
converged: YES YES NO NO
title: Mulliken charges:
elementType: O O N C C C C C C C C C C C C C C C C H H H H H H H H H H H H H H H H H H H H H H H
charge: -0.295559 -0.248404 -0.030740 -0.084801 0.001890 -0.448095 -0.460176 -0.402221 -0.397624 -0.552494 0.174374 0.270134 -0.198790 -0.330697 -0.689100 -0.688907 -0.192157 -0.373150 -0.185568 0.228051 0.239965 0.231399 0.198516 0.233177 0.204727 0.189666 0.203924 0.201275 0.205907 0.230876 0.231990 0.235082 0.243485 0.216948 0.237317 0.220339 0.218714 0.222137 0.234442 0.235523 0.238378 0.230247
chargesum: 0.00000
title: Mulliken charges with hydrogens summed into heavy atoms:
elementType: O O N C C C C C C C C C C C C C C C C
charge: -0.295559 -0.248404 -0.030740 0.143250 0.241855 -0.018181 -0.022272 -0.008630 0.009558 -0.089628 0.174374 0.270134 0.036292 -0.087212 -0.014497 -0.013614 0.043367 -0.134772 0.044679
polarizability: 2.24443692e+02 2.79379937e+00 1.66713168e+02 -2.48160765e-01 -1.24664564e+01 1.50022333e+02
1716.lowfreq: -12.6195 0.0007 0.0009 0.0010 6.4184 7.5833 11.7917 22.9861 31.0432
frequency: -11.2275 22.8382 31.0170 36.9472 57.1931 68.3769 81.5843 128.0481 162.8987 184.4246 198.4693 204.2712 225.4597 239.9092 256.2174 287.0121 309.3827 341.1863 359.9746 388.8795 398.5801 406.4358 425.2185 441.5649 485.4169 544.4244 569.6462 596.8447 624.3478 642.5317 716.1167 750.9834 763.9883 790.3130 803.2041 819.4100 828.2411 841.8010 875.5372 885.2683 898.5179 911.0318 925.2174 926.9999 954.9719 958.7459 964.1051 964.7448 972.4717 999.4218 1040.0050 1051.1073 1057.0854 1061.6624 1085.0525 1097.6463 1101.5943 1105.7595 1109.6931 1116.5413 1137.3479 1163.4550 1174.3664 1183.4584 1208.1763 1241.3146 1245.6672 1251.3395 1280.2356 1291.3384 1296.0012 1301.2970 1305.6161 1313.1768 1328.5275 1333.1182 1337.4596 1339.0749 1343.3092 1348.3632 1362.6450 1374.4514 1394.1162 1412.8392 1456.1079 1463.0044 1463.4903 1463.7659 1464.5540 1470.4084 1470.8010 1476.1080 1477.7610 1489.2544 1562.5378 1582.1987 1633.5347 2960.7872 2969.0253 2975.0900 2976.9114 2983.6511 2985.4834 2985.7278 3000.0433 3007.3744 3034.7635 3035.2722 3039.9648 3049.4297 3059.3827 3066.8206 3080.7315 3084.2365 3088.9551 3097.5727 3123.1190 3130.9334 3147.9165 3167.7660
redmass: 2.8118 4.3216 3.9664 6.1916 3.8052 3.6536 3.3568 3.5593 4.7840 2.3109 1.3196 2.1372 2.5820 1.5496 3.7294 2.6938 1.8416 2.7062 2.2510 2.5352 3.4412 3.8404 3.6704 2.9793 2.4300 3.1783 2.3249 4.9157 6.0471 3.2045 6.9619 1.8893 1.8872 2.4041 2.4944 2.4730 2.6645 2.7711 2.4675 1.6472 1.3636 2.0926 1.1742 2.0281 1.9077 2.5949 2.1089 1.7280 2.5413 1.3381 2.3728 1.7564 1.5097 2.1122 1.6626 1.5350 2.9739 2.5852 2.8478 1.6877 1.9828 1.0765 1.8794 1.4746 1.4516 2.2777 1.2910 1.3504 1.3433 1.4229 1.5644 1.3100 1.3306 2.0882 1.4420 1.5065 1.5299 1.4404 1.6512 1.5311 1.5841 1.1923 1.2091 1.9453 2.0452 1.0906 1.1210 1.0708 1.0999 1.0730 1.0567 1.0941 1.0522 1.0582 5.7282 5.8168 9.1980 1.0803 1.0650 1.0627 1.0651 1.0344 1.0516 1.0463 1.0601 1.0816 1.0960 1.0855 1.0990 1.0995 1.1024 1.1025 1.1007 1.0998 1.1012 1.0996 1.0877 1.0890 1.0947 1.1014
irintensity: 0.2137 1.1153 0.0898 2.0314 0.9235 0.5530 0.8948 1.6683 0.3369 0.8572 0.7042 0.9002 3.6573 2.1064 2.8535 6.6132 0.1196 2.2441 1.5507 0.8338 8.7314 7.5035 0.6968 3.3473 2.7107 2.7061 5.8573 3.9116 0.8432 1.2225 3.3425 28.3306 24.2797 9.0046 6.1557 8.3312 2.3597 14.0668 19.2062 3.1449 0.8286 1.0214 4.4254 2.9447 1.5260 7.1765 56.2569 24.6628 4.6994 0.1860 4.5403 6.6162 4.3364 61.4258 5.0338 21.0120 327.2157 26.9290 65.0615 34.6912 1.2107 2.0724 7.7322 1.6335 1.0419 1.1182 0.7185 1.6555 4.1632 2.5714 0.1256 16.3376 0.7985 5.1322 17.2979 1.4262 14.0841 0.6462 15.1158 1.7177 1.2785 17.1673 32.9040 18.8559 42.3756 7.4099 19.9122 7.2478 1.8478 10.2152 7.1183 3.9440 17.3779 22.7220 14.3956 55.2068 152.3210 3.9246 30.1892 33.6080 26.0552 30.0551 12.3101 26.0457 16.5871 26.4151 60.4246 6.0915 52.1887 32.0004 43.9344 21.6229 19.7856 52.7836 3.3740 46.8208 17.6030 4.3578 28.3639 25.5363
temp: 298.150 k
press: 1.00000 atm
elementType: 8 8 7 6 6 6 6 6 6 6 6 6 6 6 6 6 6 6 6 1 1 1 1 1 1 1 1 1 1 1 1 1 1 1 1 1 1 1 1 1 1 1
symmnumber: 1
zpe: 942582.7 jmol-1
zpe.correction: 0.359011 hartree
zpe.thermalcorrener: 0.377334 hartree
zpe.thermalcorrenthalpy: 0.378278 hartree
zpe.thermalcorrgfe: 0.310817 hartree
zpe.sumelectzpe: -827.263229 hartree
zpe.sumelectthermal: -827.244906 hartree
zpe.sumelectthermalent: -827.243962 hartree
zpe.sumelectthermalfe: -827.311423 hartree
dipole: -1.2993 -0.9608 3.2642
dipole: 3.6423
quadrupole: -109.9686 -108.2627 -117.1836
quadrupole: -1.1715 0.4236 -2.5363
quadrupole: 1.8363 3.5423 -5.3786 -1.1715 0.4236 -2.5363
hfenergy: -827.6222401 hartree
pointgroup: C01[X(C16H23N1O2)]
dipole: -0.5055972 0.4013817 -1.2793515 debye
polarizability: 224.4782682|1.1079896|167.6611262|2.7749063|-11.6199671|149.039798 unknown
InChI: InChI=1S/C16H23NO2/c1-12(2)16(18)19-15-9-4-3-7-13(15)11-14-8-5-6-10-17-14/h5-6,8,10,12-13,15H,3-4,7,9,11H2,1-2H3
charge 0 multiplicity 1
42 atoms
O  1.837175 0.273168 -0.31709
O  3.542263 -0.044344 1.24806
N  -3.369475 0.232968 1.049934
C  -0.325989 -0.861806 -0.168866
C  1.181921 -1.014947 0.111512
C  -1.038552 -2.206798 0.13982
C  1.821369 -2.177516 -0.668775
C  -0.420666 -3.38792 -0.643395
C  1.094658 -3.508749 -0.35895
C  -0.93678 0.318962 0.643094
C  -2.355701 0.651205 0.224185
C  3.022506 0.634307 0.330599
C  3.584753 1.938789 -0.2291
C  -2.619045 1.351125 -0.984575
C  3.765684 2.963646 0.91904
C  4.936548 1.648258 -0.934385
C  -3.952631 1.628529 -1.352252
C  -4.655743 0.508853 0.680998
C  -4.999306 1.199327 -0.502593
H  -0.440756 -0.642573 -1.252195
H  1.371266 -1.139317 1.196633
H  -2.116028 -2.108646 -0.086377
H  -0.96891 -2.408186 1.22898
H  2.893065 -2.247382 -0.408229
H  1.750149 -1.957428 -1.752603
H  -0.577669 -3.232468 -1.730904
H  -0.937383 -4.329485 -0.3758
H  1.248489 -3.774326 0.707028
H  1.541929 -4.323909 -0.958752
H  -0.289967 1.204982 0.504244
H  -0.945026 0.058733 1.717439
H  2.862192 2.327912 -0.968244
H  -1.783464 1.674918 -1.615163
H  4.205219 3.897802 0.52537
H  4.440555 2.555016 1.691507
H  2.801921 3.211588 1.399298
H  5.356408 2.584866 -1.343255
H  4.814837 0.932644 -1.767518
H  5.659327 1.224683 -0.214729
H  -4.172972 2.171624 -2.277861
H  -5.432524 0.158459 1.371195
H  -6.048552 1.394839 -0.745719
