program: Gaussian 09
title: 000234819
version: EM64L-G09RevD.01
frameworkgroup: C1[X(C21H19NO)]
method: RPBEPBE
basis: SDD
operation: Freq
keyword: #p
keyword: freq=noraman
keyword: PBEPBE/SDD
title: #p freq=noraman PBEPBE/SDD
converged: YES YES NO NO
title: Mulliken charges:
elementType: O N C C C C C C C C C C C C C C C C C C C C C H H H H H H H H H H H H H H H H H H H
charge: -0.264999 -0.469914 -0.360100 0.546735 0.442014 -0.744710 -0.457853 -0.382773 -0.384366 -0.418425 0.486224 -0.465135 -0.352585 -0.233055 -0.239311 -0.245804 0.129685 0.249150 -0.342934 -0.357364 -0.222877 -0.237269 -0.226891 0.219844 0.222373 0.221180 0.232251 0.233006 0.247213 0.237231 0.245258 0.216174 0.307426 0.223857 0.222373 0.308505 0.226950 0.275029 0.216322 0.233589 0.230340 0.233636
chargesum: 0.00000
title: Mulliken charges with hydrogens summed into heavy atoms:
elementType: O N C C C C C C C C C C C C C C C C C C C C C
charge: -0.264999 -0.161409 -0.140256 0.546735 0.442014 -0.068906 -0.224847 -0.135560 -0.147134 -0.173167 0.486224 -0.248961 -0.045159 -0.009198 -0.016938 -0.018854 0.129685 0.249150 -0.067905 -0.141042 0.010712 -0.006928 0.006745
polarizability: 3.77412846e+02 -4.07491067e+00 2.16961876e+02 -2.06577147e+01 1.57934121e+01 1.54197203e+02
1716.lowfreq: -14.9266 -2.3465 -0.4322 0.0005 0.0006 0.0007 12.7271 23.8096 25.9693
frequency: 12.1723 23.8057 25.9555 41.8214 46.1362 70.5446 78.5926 118.6837 156.1265 170.5881 198.5779 225.3908 244.8183 264.5880 293.1526 308.7792 356.5076 368.5387 402.3413 402.7013 408.5671 414.7837 448.1329 460.8291 487.1455 552.4860 563.4456 607.3205 613.7893 616.5762 638.1513 639.5423 663.5980 685.2171 702.6730 704.6187 719.2467 741.9766 781.2961 787.1750 794.7867 826.2222 829.8786 853.0234 855.1840 866.9854 870.0674 921.9267 933.4054 945.5188 978.4120 981.5535 982.8955 989.2120 991.3609 995.3582 996.5683 1005.3496 1007.8515 1023.6686 1025.2559 1042.0597 1061.5975 1079.9419 1092.7451 1100.5279 1125.4774 1172.0470 1173.8134 1189.2164 1191.1154 1193.0563 1196.4313 1209.9758 1242.9528 1260.1767 1265.3460 1296.1421 1317.1451 1321.0248 1329.5824 1376.0236 1381.7917 1384.4989 1390.7293 1411.1548 1433.6177 1435.3706 1475.3362 1477.7457 1482.0928 1483.9430 1498.9661 1508.4845 1574.6801 1589.9114 1593.7577 1608.5548 1609.6252 1613.2003 1623.9152 2962.9543 2980.6795 3077.1766 3084.0879 3102.2926 3113.8195 3115.5624 3123.8203 3128.2479 3132.3239 3133.7991 3137.3745 3145.1646 3149.7466 3158.7261 3162.9202 3170.2500 3194.3869 3529.2826
redmass: 4.7681 4.7020 3.9211 4.4673 4.8035 5.0807 5.3573 4.4239 5.2162 4.1802 4.4025 4.3792 3.9993 3.0173 1.1627 6.2628 5.1316 4.6168 2.8238 2.8186 3.1281 4.4292 3.9365 4.0885 4.0070 3.0809 3.2838 4.0975 6.0360 6.2779 1.2697 5.7272 4.9360 5.0938 1.5163 1.9437 2.6909 3.4915 2.2713 2.3883 2.8219 1.8369 2.9152 1.3359 1.2517 5.1215 1.4160 1.3920 1.4508 1.3755 1.4182 2.2093 1.4298 5.2718 3.9447 1.3939 1.3606 1.3468 2.8531 2.4184 2.2239 1.6527 2.0822 1.9071 2.1617 1.8108 1.3924 1.0511 1.0582 1.2704 1.1632 1.1640 1.8201 1.7953 3.5202 2.0047 1.7334 1.5085 1.3461 1.5268 1.3010 4.5766 5.3939 8.6337 1.2146 3.5413 2.2471 2.1965 2.0903 1.0757 1.2112 1.8081 2.1734 2.7252 6.6293 5.6733 5.4363 4.9569 6.0855 6.0088 6.3856 1.0827 1.0355 1.1002 1.0993 1.0872 1.0878 1.0860 1.0866 1.0952 1.0868 1.0917 1.0924 1.0919 1.0947 1.0956 1.1009 1.1006 1.0943 1.0758
irintensity: 1.3100 0.0193 0.0552 1.3946 0.2821 0.1624 2.4667 3.6520 0.8144 0.2771 0.6386 1.5210 4.9528 3.9402 2.0798 2.1214 1.3164 1.9952 0.0800 0.5266 0.5062 0.6386 9.1667 3.0609 5.0528 27.9039 16.3728 2.4969 1.1290 0.1478 32.6360 0.4996 29.4704 11.8636 96.7619 47.0452 23.6591 3.6154 14.4354 37.1926 1.9507 32.5823 12.6960 0.6061 1.0273 14.5404 38.3807 5.0890 3.0030 0.6963 0.1332 2.9953 1.9525 0.6698 0.4022 0.2230 3.1412 2.3006 8.4441 33.7280 6.1995 10.0446 16.1730 19.1304 4.9919 5.3448 17.7193 0.0397 1.5613 0.1558 14.4230 2.6551 1.5938 0.5462 74.1539 41.7046 8.3220 9.3065 11.3073 64.8839 4.8910 71.7648 48.5630 9.5341 13.0228 48.6312 5.5939 10.7261 36.1988 18.0940 7.5394 17.7199 80.0365 467.8366 69.3410 11.3041 30.5012 50.0477 6.0996 9.2618 10.5143 18.5407 30.3007 47.0741 35.1859 24.4704 14.2451 7.4762 0.2747 26.2298 0.6514 5.8138 25.7740 21.5599 38.9998 16.9260 22.3431 24.4406 5.4530 9.4192
temp: 298.150 k
press: 1.00000 atm
elementType: 8 7 6 6 6 6 6 6 6 6 6 6 6 6 6 6 6 6 6 6 6 6 6 1 1 1 1 1 1 1 1 1 1 1 1 1 1 1 1 1 1 1
symmnumber: 1
zpe: 892038.9 jmol-1
zpe.correction: 0.339760 hartree
zpe.thermalcorrener: 0.359473 hartree
zpe.thermalcorrenthalpy: 0.360417 hartree
zpe.thermalcorrgfe: 0.287981 hartree
zpe.sumelectzpe: -940.032911 hartree
zpe.sumelectthermal: -940.013198 hartree
zpe.sumelectthermalent: -940.012254 hartree
zpe.sumelectthermalfe: -940.084690 hartree
dipole: -1.5434 2.8876 1.9828
dipole: 3.8277
quadrupole: -109.2768 -126.8251 -135.5283
quadrupole: -6.8912 -9.9160 1.4044
quadrupole: 14.5999 -2.9483 -11.6516 -6.8912 -9.9160 1.4044
hfenergy: -940.3726711 hartree
pointgroup: C01 [X(C21H19N1O1)]
dipole: -0.5826433 1.1959392 0.7057954 debye
polarizability: 376.0342977|-5.9954326|219.0864936|-26.5975178|10.9673052|153.4511326 unknown
InChI: InChI=1S/C21H19NO/c1-16(17-8-4-2-5-9-17)18-12-14-20(15-13-18)22-21(23)19-10-6-3-7-11-19/h2-16,22H,1H3
charge 0 multiplicity 1
42 atoms
O  -2.51547 -1.555618 -0.849378
N  -2.146179 0.484819 0.255341
C  3.575809 1.40748 -0.243074
C  2.076864 1.112602 -0.081235
C  4.442508 0.155772 -0.019997
C  3.826213 2.116066 -1.600195
C  1.241549 1.999543 0.642402
C  1.471836 -0.012891 -0.695437
C  4.379466 -0.505094 1.236917
C  5.312944 -0.368769 -1.007133
C  -0.73788 0.645722 0.117221
C  -0.145211 1.774487 0.743723
C  0.086865 -0.257956 -0.606393
C  5.161231 -1.648462 1.501397
C  6.097739 -1.518188 -0.748089
C  6.027187 -2.162322 0.506125
C  -2.961383 -0.537335 -0.233992
C  -4.436279 -0.365255 0.0385
C  -5.238019 -1.535551 0.025372
C  -5.054708 0.89399 0.262693
C  -6.625714 -1.454643 0.260397
C  -6.445748 0.97482 0.493001
C  -7.23371 -0.199319 0.500228
H  3.846989 2.133063 0.552668
H  3.548189 1.466088 -2.449911
H  4.886554 2.407753 -1.713302
H  3.209019 3.029074 -1.666911
H  1.679902 2.877192 1.133899
H  2.098958 -0.72519 -1.244369
H  3.700843 -0.120009 2.008391
H  5.388437 0.115425 -1.986235
H  -0.770238 2.475857 1.312719
H  -0.364782 -1.133849 -1.074862
H  5.095684 -2.140526 2.478595
H  6.763584 -1.907421 -1.527097
H  -2.608919 1.198031 0.822984
H  6.635276 -3.051536 0.707028
H  -4.748243 -2.492798 -0.180403
H  -4.475326 1.824696 0.213299
H  -7.233663 -2.365829 0.254191
H  -6.915379 1.951444 0.65356
H  -8.312595 -0.134962 0.679563
