program: Gaussian 09
title: 000234816
version: EM64L-G09RevD.01
frameworkgroup: C1[X(C19H23NO)]
method: RPBEPBE
basis: SDD
operation: Freq
keyword: #p
keyword: freq=noraman
keyword: PBEPBE/SDD
title: #p freq=noraman PBEPBE/SDD
converged: YES YES NO NO
title: Mulliken charges:
elementType: O N C C C C C C C C C C C C C C C C C C C H H H H H H H H H H H H H H H H H H H H H H H
charge: -0.477794 -0.158049 -0.342310 -0.361365 -0.429352 -0.401327 -0.389214 -0.397710 -0.215836 -0.169083 0.349415 0.312040 0.286016 -0.548669 0.289451 -0.548915 -0.430210 -0.433030 -0.443245 -0.434347 -0.246080 0.224543 0.184529 0.181401 0.221879 0.218785 0.244394 0.207417 0.198495 0.197590 0.205552 0.191075 0.218630 0.209262 0.231350 0.233179 0.233030 0.232102 0.283160 0.236897 0.227393 0.239303 0.216460 0.353190
chargesum: 0.00000
title: Mulliken charges with hydrogens summed into heavy atoms:
elementType: O N C C C C C C C C C C C C C C C C C C C
charge: -0.124604 -0.158049 0.066761 0.041915 0.033826 0.004585 0.013927 0.011995 -0.006574 -0.169083 0.349415 0.312040 0.286016 -0.084140 0.289451 -0.083782 -0.147050 -0.196132 -0.215852 -0.195045 -0.029620
polarizability: 2.86204686e+02 2.90870904e+00 2.30519569e+02 1.52218963e+01 -1.95283856e-01 1.34592588e+02
1716.lowfreq: -9.9455 -0.0004 0.0003 0.0004 5.3205 11.8109 27.0586 32.4293 38.7141
frequency: 26.6857 32.3688 38.6859 72.8166 87.2955 99.6629 136.8068 173.4932 179.4461 198.8013 221.7012 233.2136 289.7202 311.3941 332.9211 355.0639 397.3885 421.2427 435.0693 448.5251 448.9274 465.7900 483.3961 512.2170 528.6213 561.0585 568.6542 594.7832 639.0367 647.7205 676.8082 723.4034 738.9626 751.1413 777.6307 790.6501 802.1049 804.1488 837.9087 847.9400 852.7096 858.6173 863.4115 894.7533 900.7077 921.9234 955.7215 956.6037 967.9578 972.9992 990.4498 1009.3299 1011.9099 1019.7135 1038.9644 1048.1564 1057.8064 1083.4495 1103.2658 1116.9336 1119.4957 1142.3974 1149.3258 1151.5023 1156.9324 1175.4897 1185.0291 1202.7294 1212.2949 1220.9294 1233.5742 1250.2837 1258.3021 1263.0291 1266.6156 1276.4200 1288.7218 1294.6507 1314.1520 1321.5170 1333.1297 1341.0646 1350.6328 1358.2854 1370.9410 1376.8139 1385.3428 1400.1647 1416.9141 1445.4529 1453.6987 1455.1889 1460.5827 1462.9434 1465.6442 1467.0139 1469.6914 1475.9429 1482.3839 1510.7917 1602.4654 1609.4514 1621.5228 2863.4687 2869.5828 2912.7748 2936.1750 2968.9860 2986.4520 2987.4150 2987.8704 3001.0320 3030.4535 3033.0590 3034.4975 3040.1116 3047.5826 3050.4760 3052.7794 3056.1736 3117.5827 3129.2236 3133.9682 3151.4752 3163.8754 3197.9643
redmass: 4.3239 3.0286 4.1830 3.5057 2.0016 3.5882 4.5248 4.1441 3.1881 4.3570 3.0968 1.8116 5.2186 2.0803 3.9914 2.8141 2.0129 3.7506 3.6821 3.5937 3.0715 3.2505 3.0979 5.9367 2.6574 5.6294 2.3526 2.7807 5.0849 3.8335 4.5349 1.1409 3.3728 1.7848 1.5582 3.0242 2.2106 2.0917 2.4786 1.7412 2.6879 1.8149 1.7090 1.4594 2.2295 3.1708 1.3596 2.9611 1.3499 1.3961 2.4484 4.0599 1.9456 2.5796 2.8690 2.1547 2.2892 1.4911 2.4969 2.7165 2.6669 1.1759 1.3448 2.1990 2.0585 1.2619 1.2863 1.1033 1.4940 1.2704 1.8527 1.5830 1.8223 1.3671 1.2164 1.2303 1.8482 1.3917 1.2776 1.2681 1.3391 1.4156 1.4870 1.4164 2.6151 1.6381 1.7429 2.1047 2.4256 1.2050 1.0911 1.0945 3.1016 1.0903 1.0971 1.3477 1.0882 2.4777 1.1028 4.4976 6.5987 8.4159 7.8049 1.0709 1.0698 1.0817 1.0668 1.0634 1.0619 1.0608 1.0591 1.0618 1.1026 1.0888 1.0930 1.0923 1.1030 1.0946 1.1024 1.1038 1.0852 1.0900 1.0916 1.0982 1.0928 1.0635
irintensity: 0.6585 0.1026 0.5594 0.8848 0.2628 2.2285 0.7222 1.8901 1.5884 5.4548 6.4915 0.3198 3.8207 8.5450 4.1241 1.3913 7.3817 1.0489 1.0811 0.4295 0.2676 0.0352 0.6069 2.7418 1.1545 1.1859 3.3912 0.8719 3.4384 0.3286 13.7420 54.1880 14.0425 10.0559 37.7322 13.6117 3.5419 1.8635 1.0417 3.7631 10.0590 31.7780 35.5565 8.9632 1.7651 2.0524 4.8263 1.4336 1.8246 1.7070 26.8738 11.4697 0.3404 17.0186 18.6703 8.9239 42.9834 8.8514 43.3358 1.1814 5.8179 0.4716 9.7854 22.0844 14.9659 16.6853 1.1020 0.0025 8.1409 0.1493 4.8489 12.5289 2.1441 2.5236 6.9454 7.8564 2.1867 1.9539 30.4222 14.8845 3.0365 0.2319 2.0955 8.2176 14.4137 43.4089 32.0273 24.4821 16.2649 5.4100 12.7796 5.7262 5.7271 7.2414 12.6380 18.0812 5.3007 0.5603 13.1106 5.9482 13.8622 11.8543 11.6995 31.2359 120.6324 40.4077 55.3592 40.0738 28.1343 32.5423 20.5169 63.7673 0.0196 47.0465 68.8443 16.0177 22.4908 20.5293 34.6245 91.5766 1.8753 20.5800 31.0844 36.6070 4.4078 261.4641
temp: 298.150 k
press: 1.00000 atm
elementType: 8 7 6 6 6 6 6 6 6 6 6 6 6 6 6 6 6 6 6 6 6 1 1 1 1 1 1 1 1 1 1 1 1 1 1 1 1 1 1 1 1 1 1 1
symmnumber: 1
zpe: 986147.7 jmol-1
zpe.correction: 0.375604 hartree
zpe.thermalcorrener: 0.393648 hartree
zpe.thermalcorrenthalpy: 0.394592 hartree
zpe.thermalcorrgfe: 0.328510 hartree
zpe.sumelectzpe: -866.256515 hartree
zpe.sumelectthermal: -866.238471 hartree
zpe.sumelectthermalent: -866.237527 hartree
zpe.sumelectthermalfe: -866.303608 hartree
dipole: -1.2172 1.7868 2.3257
dipole: 3.1754
quadrupole: -100.8677 -121.4668 -130.7600
quadrupole: -4.2417 0.0030 -4.8229
quadrupole: 16.8304 -3.7686 -13.0618 -4.2417 0.0030 -4.8229
hfenergy: -866.6321188 hartree
pointgroup: C01 [X(C19H23N1O1)]
dipole: 0.4762371 -0.482295 1.0494338 debye
polarizability: 285.5499096|-3.4306733|225.3012575|-18.4222511|-21.3969289|140.4656765 unknown
InChI: InChI=1S/C19H23NO/c21-18(13-20-11-2-1-3-12-20)16-10-9-15-8-7-14-5-4-6-17(16)19(14)15/h4-6,9-10,18,21H,1-3,7-8,11-13H2
charge 0 multiplicity 1
44 atoms
O  1.635127 1.165986 -1.696505
N  3.201939 0.066655 0.170438
C  3.687744 -1.282312 -0.235757
C  4.047567 0.662327 1.241523
C  1.746607 0.089679 0.479345
C  5.147195 -1.222892 -0.729853
C  5.514982 0.778867 0.782925
C  6.066225 -0.597365 0.344278
C  0.946652 0.18255 -0.863837
C  -2.790702 0.109784 0.084823
C  -0.500979 0.58584 -0.63005
C  -1.464689 -0.375047 -0.145882
C  -3.196074 1.457348 -0.143106
C  -4.677134 1.598519 0.207208
C  -3.862896 -0.700796 0.561305
C  -5.120901 0.159715 0.680562
C  -0.910261 1.909481 -0.863308
C  -2.251282 2.36412 -0.625024
C  -1.252012 -1.772124 0.126519
C  -3.626241 -2.051717 0.821027
C  -2.306503 -2.572907 0.592253
H  3.03122 -1.662967 -1.039227
H  3.612706 -1.995795 0.623735
H  4.001305 0.04417 2.173575
H  3.640506 1.660779 1.484959
H  1.41501 -0.786285 1.080284
H  1.535247 1.00472 1.061648
H  5.187387 -0.614173 -1.654037
H  5.486896 -2.243745 -0.989467
H  6.122944 1.198437 1.607125
H  5.569059 1.487975 -0.066122
H  6.115718 -1.271548 1.22465
H  7.098014 -0.495573 -0.041329
H  0.971189 -0.808753 -1.370494
H  -4.835674 2.349764 1.003543
H  -5.268071 1.932952 -0.666016
H  -5.939936 -0.235752 0.05107
H  -5.500053 0.177067 1.719609
H  -0.160836 2.599786 -1.262682
H  -2.510145 3.409058 -0.830814
H  -0.269147 -2.227473 -0.038957
H  -4.417702 -2.715906 1.186337
H  -2.121417 -3.636213 0.786503
H  2.591711 1.093067 -1.373578
