program: Gaussian 09
title: 000234811
version: EM64L-G09RevD.01
frameworkgroup: C1[X(C8H8Cl2N2S)]
method: RPBEPBE
basis: SDD
operation: Freq
keyword: #p
keyword: freq=noraman
keyword: PBEPBE/SDD
title: #p freq=noraman PBEPBE/SDD
converged: YES YES NO NO
title: Mulliken charges:
elementType: Cl Cl S N N C C C C C C C C H H H H H H H H
charge: -0.053413 -0.050742 0.163806 -0.601319 -0.351155 0.643649 -0.873624 -0.289817 -0.338614 -0.210042 -0.224801 -0.091316 -0.059871 0.295079 0.327732 0.291720 0.280579 0.257123 0.321371 0.332892 0.230762
chargesum: 0.00000
title: Mulliken charges with hydrogens summed into heavy atoms:
elementType: Cl Cl S N N C C C C C C C C
charge: -0.053413 -0.050742 0.163806 0.052944 -0.120393 0.643649 -0.250814 -0.289817 -0.046894 0.070537 0.032323 -0.091316 -0.059871
polarizability: 1.83715519e+02 2.54160600e+00 1.48007229e+02 5.22040828e-01 -1.07535461e+01 8.20331925e+01
1716.lowfreq: -7.9065 -3.2865 -0.0018 -0.0018 -0.0007 5.6073 20.9616 35.8434 55.5534
frequency: 20.6334 35.8191 55.5527 71.6694 137.8558 164.8592 172.6361 189.9496 293.9209 307.5924 333.5540 367.3606 381.3762 405.1869 424.3090 429.2277 452.7993 459.2188 543.0983 557.9875 587.1462 621.2140 641.4519 690.5822 722.1202 734.8746 818.8284 842.0676 861.2174 882.1733 976.4133 992.2570 1026.2201 1045.6826 1079.6868 1133.3598 1187.9302 1218.3017 1252.3224 1270.1660 1289.6616 1367.5428 1379.1213 1434.1062 1459.7888 1566.6867 1592.0824 1613.8993 1639.7521 3033.5659 3124.7061 3143.7641 3174.9845 3185.5215 3373.9285 3526.4165 3673.0336
redmass: 6.6556 6.1297 5.7335 10.3337 9.5569 6.0045 8.5128 14.6848 2.8795 6.2364 1.0861 9.0812 5.0645 4.1170 1.3121 2.9324 4.0588 6.7632 5.5410 3.0492 2.7782 4.9797 7.0665 7.4835 1.4512 4.0112 4.4450 1.4918 1.4042 1.7761 1.3437 1.7370 4.0583 1.5622 2.4120 1.4549 1.1026 2.7144 1.1749 1.3373 2.7072 3.6848 4.8590 1.1923 2.4280 7.9155 7.2579 1.5650 2.4990 1.0606 1.1049 1.0910 1.0956 1.0936 1.0768 1.0450 1.1043
irintensity: 3.5319 3.1978 4.5620 4.9648 2.3025 0.5708 2.3457 1.9697 9.9631 0.0057 5.0488 14.9325 8.1154 39.0230 266.4814 11.4431 5.0371 4.9024 8.4643 19.5212 69.1371 28.9062 6.0499 29.3851 93.4527 4.8939 56.6664 39.7621 20.8511 17.1246 2.5168 134.6804 29.7332 4.9221 24.4369 4.7623 2.8813 8.7147 18.3978 6.0506 199.0301 7.3594 10.4079 32.8943 97.8060 27.8442 44.2160 90.6745 251.8431 13.6271 5.2632 3.7340 2.8647 0.4793 19.2496 41.7572 25.3615
temp: 298.150 k
press: 1.00000 atm
elementType: 17 17 16 7 7 6 6 6 6 6 6 6 6 1 1 1 1 1 1 1 1
symmnumber: 1
zpe: 382608.7 jmol-1
zpe.correction: 0.145728 hartree
zpe.thermalcorrener: 0.159398 hartree
zpe.thermalcorrenthalpy: 0.160342 hartree
zpe.thermalcorrgfe: 0.102776 hartree
zpe.sumelectzpe: -1736.377927 hartree
zpe.sumelectthermal: -1736.364257 hartree
zpe.sumelectthermalent: -1736.363313 hartree
zpe.sumelectthermalfe: -1736.420879 hartree
dipole: 4.0181 -2.5225 -0.8185
dipole: 4.8144
quadrupole: -83.8974 -91.4376 -96.9645
quadrupole: -12.7584 -8.0166 1.1766
quadrupole: 6.8691 -0.6711 -6.1980 -12.7584 -8.0166 1.1766
hfenergy: -1736.523655 hartree
pointgroup: C01 [X(C8H8Cl2N2S1)]
dipole: 1.6500632 0.8751239 0.3149352 debye
dipolederiv: -0.1531498 0.0519625 0.0124671 0.0568217 -0.7572288 0.056156 0.0101313 0.0863607 -0.0802547 -0.7675697 0.2901111 0.133541 0.2974201 -0.2643323 -0.0449749 0.1844891 -0.0646538 -0.1044174 -0.624381 -0.1195699 -0.0052444 -0.2340449 -0.350302 -0.0428745 -0.1762969 0.0172731 -0.1428655 -1.1323535 0.0310838 -0.3404413 -0.1802164 -0.4124141 -0.2757593 -0.363251 -0.1657785 -0.8294505 -0.4978576 0.2036242 -0.1186331 0.0299055 -0.6834708 0.3257464 0.0564615 0.4720652 -0.902698 0.0754962 -0.0101436 -0.0010808 -0.0824382 -0.3330587 0.0241581 0.0590282 -0.0048824 -0.0818884 0.5512825 -0.0136473 0.1025082 -0.1580198 0.0313595 0.0778203 0.2514702 0.1083713 0.1365416 0.1909605 -0.1197455 -0.0606582 -0.0064959 1.1155348 -0.1186718 -0.0866002 -0.1630945 -0.0223657 -0.0328376 -0.0618355 -0.0556522 -0.0150484 0.0668976 0.0014548 -0.0279694 0.0108602 -0.1139858 -0.3119013 0.1901696 0.030304 0.2147247 -0.3871667 -0.0079321 0.0520216 -0.0058308 -0.0731302 -0.3686211 0.0621233 0.0486959 0.0493668 -0.0197698 -0.0504452 0.0846769 -0.0329393 -0.1195053 1.0494757 -0.3959695 -0.2669416 -0.4406866 0.4103344 0.0501162 -0.2969918 0.0507202 0.0188233 0.9937585 0.3258639 0.5607469 0.7503827 0.9608636 -0.2608352 0.4592418 -0.4332304 0.9701464 0.0060067 -0.0315521 -0.05288 0.0428243 -0.0129896 -0.0782196 -0.0578636 -0.0282157 0.0858866 0.0563355 0.0453159 0.0004543 0.0639296 0.1249519 0.0926319 -0.0351306 0.0157277 0.0299117 0.1386214 -0.0422669 0.0687753 -0.0395943 0.0476226 0.0080386 0.040379 0.013578 0.130823 0.0519702 -0.0326655 0.040036 -0.0354375 0.075912 0.0276073 0.0458719 0.0282149 0.1527845 0.0914057 0.029434 0.0172247 0.0385333 -0.0339417 0.0269551 0.0182436 0.0228835 0.1563335 0.2725969 -0.0839265 -0.0698164 -0.0873416 0.1772833 0.0808164 -0.0766472 0.0766098 0.2373048 0.3491374 -0.0743163 -0.0551922 -0.0503506 0.2016993 0.0956375 -0.0377699 0.0799187 0.2573637 0.0616243 -0.2440497 0.0117869 -0.2142346 0.0422157 0.0125739 -0.1034946 -0.0839579 0.2946424 unknown
polarizability: 183.1316795|-5.1806039|148.142541|-0.589574|-12.0558586|82.4817203 unknown
InChI: InChI=1S/C8H8Cl2N2S/c9-6-2-1-5(7(10)3-6)4-13-8(11)12/h1-3,11H,4,12H2
charge 0 multiplicity 1
21 atoms
Cl -1.028235 -3.023709 0.205218
Cl -4.265298 1.458718 0.541602
S  2.403902 -1.092743 0.571129
N  4.284006 0.699815 1.241239
N  2.998925 1.252757 -0.750289
C  -0.153021 -0.449425 -0.526622
C  1.184615 -1.033211 -0.89555
C  -1.233237 -1.222482 -0.034672
C  -0.378732 0.94653 -0.678285
C  -2.485981 -0.669434 0.295376
C  -1.616881 1.540768 -0.357549
C  -2.653328 0.717544 0.123907
C  3.309836 0.500297 0.270162
H  1.119252 -2.07806 -1.232204
H  1.702739 -0.403092 -1.637003
H  0.457371 1.556651 -1.037152
H  -3.297973 -1.296594 0.66998
H  -1.772665 2.615958 -0.480781
H  4.859763 1.539321 1.226718
H  4.428369 0.026973 1.992584
H  3.569772 2.110215 -0.864907
